{"text_format":"1","workbook":"xlsx","n_sheets":18,"sheets":["Caratula Resumen","A Y  II D3","B)","A Y II D4","II B) Y 1","II C y 1_","II D) 2","II D) 4","II D) 4 A","II D) 6","II D) 7 1","II D) 7 2 ","II D) 7 3","E)","F) 1","F) 2","G)","Listas"],"not_rendered":{"charts":0,"images":16,"macros":1,"external_links":1,"defined_names":23,"comments":16,"pivot_tables":0},"unopened":[],"bounds":{"document_bytes":16777216,"sheet_cells":100000,"rows_first":2000,"rows_last":500,"rows_between":2000,"halvings":0,"cell_chars":16384,"cell_head_chars":4096},"cells_cut":0,"cells_raw":0,"read":"whole","date_system":"1900"}

{"sheet":"Caratula Resumen","index":0,"n_rows":73,"n_cols":18,"rows_kept":73,"cut":false,"hidden":false,"merged":[[69,2,69,5],[71,2,71,5],[72,2,72,5],[73,2,73,5],[20,3,20,14],[21,3,21,14],[22,3,22,14],[49,3,49,6],[62,2,62,5],[63,2,63,5],[65,2,65,5],[66,2,66,5],[68,2,68,5],[43,3,43,6],[44,3,44,6],[45,3,45,6],[46,3,46,6],[47,3,47,6],[48,3,48,6],[37,3,37,6],[38,3,38,6],[39,3,39,6],[40,3,40,6],[41,3,41,6],[42,3,42,6],[36,3,36,6],[10,3,10,18],[11,3,11,18],[12,3,12,18],[34,3,34,6],[35,3,35,6]]}
[]
[]
[]
[]
[]
[]
[]
[]
[]
[]
[]
[null,null,null,"FORMATOS ENTREGADOS PARA DAR CUMPLIMIENTO AL ARTICULO 73 DE \"LA LEY GENERAL DE CONTABILIDAD GUBERNAMENTAL\""]
[]
[]
[]
[]
[]
[]
[]
[]
[null,null,"Entidad Federativa :"," NAYARIT "]
[null,null,"Fondo :","Fondo de Aportaciones para la Educación Tecnológica y de Adultos/Instituto Nacional para la Educación de los Adultos (FAETA/INEA)"]
[null,null,"Periodo :","1er. Trimestre"]
[]
[]
[]
[]
[]
[]
[]
[]
[null,null,null,null,null,null,null,"TOTAL REGISTROS ",null,"Num. de Paginas",null,"TOTAL PERSONAS",null,"TOTAL PLAZAS",null,"Total Pto. Federal",null,"Total Ppto. Otras Fuentes"]
[]
[]
[null,1,"A Y II D3","Personal Comisionado",null,null,null,{"$f":"'A Y  II D3'!N21","v":4},null,1,null,{"$f":"H35","v":4},null,{"$f":"H35","v":4},null,{"$f":"'A Y  II D3'!Q21","v":246303.09},null,{"$f":"'A Y  II D3'!R21","v":0}]
[null,2,"A Y II D4","Personal con Licencia",null,null,null,{"$f":"'A Y II D4'!E42","v":8},null,1,null,{"$f":"H36","v":8},null,{"$f":"H36:H36","v":8},null,{"$f":"'A Y II D4'!P44","v":104256.42},null,{"$f":"'A Y II D4'!Q44","v":0}]
[null,3,"B)   ","Registro Federal de Contribuyentes de Trabajadores con Pagos Retroactivos con un Periodo Mayor a 45 días",null,null,null,0,null,1,null,0,null,0,null,"N/A",null,"N/A"]
[null,4,"II B) Y 1","Plaza / Función",null,null,null,{"$f":"'II B) Y 1'!B179","v":159},null,4,null,{"$f":"H38","v":159},null,"N/A",null,"N/A",null,"N/A"]
[null,5,"II C y 1_","Personal Federalizado por Registro Federal de Contribuyentes",null,null,null,159,null,3,null,{"$f":"H39","v":159},null,"N/A",null,{"$f":"'II C y 1_'!T175","v":7672029.0800000038},null,"N/A"]
[null,6,"II D) 2","Movimientos de Plazas",null,null,null,{"$f":"'II D) 2'!M20","v":288},null,1,null,{"$f":"H40","v":288},null,{"$f":"H40","v":288},null,"N/A",null,"N/A"]
[null,7,"II D) 4","Trabajadores Jubilados en el Periodo",null,null,null,{"$f":"'II D) 4'!C23","v":2},null,1,null,{"$f":"H41","v":2},null,{"$f":"H41","v":2},null,"N/A",null,"N/A"]
[null,8,"II D) 4 A","Trabajadores que Tramitaron Licencia Prejubilatoria en el Periodo",null,null,null,{"$f":"'II D) 4 A'!D20","v":3},null,1,null,{"$f":"H42","v":3},null,{"$f":"H42","v":3},null,{"$f":"'II D) 4 A'!P20","v":186689.97},null,{"$f":"'II D) 4 A'!Q20","v":0}]
[null,9,"II D) 6","Trabajadores Contratados por Honorarios en el Periodo",null,null,null,{"$f":"'II D) 6'!D31","v":12},null,1,null,12,null,"N/A",null,"N/A",null,"N/A"]
[null,10,"II D) 7 1 ","Analítico de Categorías / Plazas Autorizadas con su Tabulador",null,null,null,24,null,1,null,"N/A",null,"N/A",null,"N/A",null,"N/A"]
[null,11,"II D) 7 2 ","Catálogo de Categorías y Tabuladores",null,null,null,735,null,20,null,"N/A",null,"N/A",null,"N/A",null,"N/A"]
[null,12,"II D) 7 3 ","Catálogo de Percepciones y Deducciones",null,null,null,117,null,3,null,"N/A",null,"N/A",null,"N/A",null,"N/A"]
[null,13,"E)","Trabajadores que Cobran con RFC / CURP con Formato Incorrecto",null,null,null,0,null,1,null,0,null,"N/A",null,"N/A",null,"N/A"]
[null,14,"F) 1","Trabajadores con Doble Asignación Salarial en Municipios no Colindantes Geográficamente",null,null,null,0,null,1,null,0,null,"N/A",null,"N/A",null,"N/A"]
[null,15,"F) 2","Trabajadores Ocupando Plazas que Superan el Número de Horas de Compatibilidad Autorizadas",null,null,null,0,null,1,null,0,null,0,null,"N/A",null,"N/A"]
[null,16,"G)","Trabajadores Cuyo Salario Básico Supere los Ingresos Promedio de un Docente en la Categoría más Alta del Tabulador Salarial Correspondiente a Cada Entidad",null,null,null,0,null,1,null,0,null,"N/A",null,"N/A",null,"N/A"]
[]
[]
[]
[]
[]
[]
[]
[]
[]
[]
[]
[]
[null,null,"LIC. LIZETH DEL ROCIO NUÑEZ ORTEGA "]
[null,null,"Nombre del  Responsable"]
[]
[null,null,"JEFA DEL DEPARTAMENTO DE ADMINISTRACION "]
[null,null,"Cargo"]
[]
[]
[null,null,"Firma"]
[]
[null,null,"2020-04-03"]
[null,null,"Fecha"]

{"sheet":"A Y  II D3","index":1,"n_rows":26,"n_cols":26,"rows_kept":26,"cut":false,"hidden":false,"merged":[[9,2,9,8],[12,7,12,13],[12,2,13,2],[12,3,13,3],[12,4,13,4],[12,5,13,5],[12,6,13,6],[22,13,22,15],[12,25,13,25],[12,14,12,15],[12,16,13,16],[12,17,13,17],[12,18,13,18],[12,19,12,20],[12,21,13,21],[20,14,20,15],[12,22,13,22],[12,23,13,23],[12,24,13,24]]}
[]
[]
[]
[]
[]
[]
[]
[]
[null,null,"Formato: Personal Comisionado"]
[null,null,{"$f":"IF('Caratula Resumen'!D22=\"Elige el Periodo…\",\"\",'Caratula Resumen'!D22)","v":"Fondo de Aportaciones para la Educación Tecnológica y de Adultos/Instituto Nacional para la Educación de los Adultos (FAETA/INEA)"},null,null,null,null,null,null,null,null,null,null,null,null,null,null,null,null,null,null,null,null,null,{"$f":"IF('Caratula Resumen'!D23=\"Elige el Periodo…\",\"\",'Caratula Resumen'!D23)","v":"1er. Trimestre"}]
[]
[]
[null,null,"Entidad Federativa","R.F.C.","CURP","Nombre","Clave integrada","Clave Presupuestal",null,null,null,null,null,null,"Fecha Comisión",null,"Percepciones pagadas en el Periodo de Comisión con Presupuesto Federal*","Percepciones pagadas en el Periodo de Comisión con Presupuesto de otra fuente*","Clave CT Origen","CT Destino dentro del sector",null,"Lugar de la comisión fuera del sector educativo","Tipo de Comisión","Función Específica","Objeto de la comision","No. Oficio"]
[null,null,null,null,null,null,null,"Partida Presupuestal","Código de Pago","Clave de Unidad","Clave de Sub Unidad","Clave de Categoría","Horas Semana Mes ","Número de Plaza","Inicio","Conclusión",null,null,null,"Clave","Turno"]
[]
[null,null,"Entidad Federativa","R.F.C.","CURP","Nombre","Clave integrada","Partida Presupuestal","Código de Pago","Clave de Unidad","Clave de Sub Unidad","Clave de Categoría","Horas Semana Mes ","Número de Plaza","Fecha Comisión\nInicio","Fecha Comisión\nConclusión","Percepciones pagadas en el Periodo de Comisión con Presupuesto Federal*","Percepciones pagadas en el Periodo de Comisión con Presupuesto de otra fuente*","Clave CT Origen","Clave","Turno","Lugar de la comisión fuera del sector educativo","Tipo de Comisión","Función Específica","Objeto de la comision","No. Oficio"]
[null,null,"NAYARIT","VIAB780203S93","VIAB780203HNTLLS09","BASILIO VILLASEÑOR ALCANTAR","8310101715TO382000.084",83101,"01",7,15,"T03820","00.0",84,20141031,99999999,60630.33,0,"18FIA0001J","18FIA0001J","100","Tepic Nayarit  San luis #120. Col. centro ","a","REPRESENTAR AL SINDICATO","SECRETARIO GENERAL","DPAyE/1697/2014"]
[null,null,"NAYARIT","VARE720715LZ0","VARE720715MNTRMN06","ENRIQUETA VARGAS ROMERO","8310101714T032000.0917",83101,"02",7,14,"T03821","00.1",91,20141031,99999999,63823.23,0,"18FIA0001J","18FIA0001J","100","Tepic Nayarit  San luis #120. Col. centro ","a","REPRESENTAR AL SINDICATO","SECRETARIA DE ORGANIZACIÓN Y FINANZAS","DPAyE/1697/2014"]
[null,null,"NAYARIT","AISG630112M7A","AISG630112MNTMND00","MARIA GUADALUPE AMBRIZ SANDOVAL","8310101714T0382000.01147",83101,"03",7,14,"T03822","00.2",114,20141031,99999999,60428.71,0,"18FIA0001J","18FIA0001J","100","Tepic Nayarit  San luis #120. Col. centro ","a","REPRESENTAR AL SINDICATO","SECRETARIA DE HONOR Y JUSTICIA","DPAyE/1697/2014"]
[null,null,"NAYARIT","MAMD710507CG4","MAMD710507MNTRRL06","DALIA CARMINA MARES MORA","831010126A0180700.054",83101,"01",2,6,"A01807","00.0",54,20141031,99999999,61420.82,0,"18FIA0001J","18FIA0001J","100","Tepic Nayarit  San luis #120. Col. centro ","a","REPRESENTAR AL SINDICATO","SECRETARIA DE TRABAJO Y CONFLICTOS","DPAyE/1697/2014"]
[null,null,"Total Personas : ",4,null,null,null,null,null,null,null,"Total Plazas : ",null,4,"Total Pto. Federal",null,{"$f":"SUM(Q17:Q20)","v":246303.09}]
[]
[null,null,null,null,null,null,null,null,null,null,null,null,null,"Total Ppto. Otras Fuentes",null,null,4]
[]
[null,null,"*Total de Percepciones reportadas por la Entidad Federativa como pagadas al trabajador durante la comisión."]
[null,null,"Fuente : Información proporcionada por las Entidades Federativas."]

{"sheet":"B)","index":2,"n_rows":29,"n_cols":19,"rows_kept":29,"cut":false,"hidden":false,"merged":[[9,1,9,10],[12,1,13,1],[12,2,13,2],[12,3,13,3],[12,4,13,4],[12,5,12,11],[12,18,13,18],[12,12,13,12],[12,13,13,13],[12,14,13,14],[12,15,12,16],[12,17,13,17]]}
[]
[]
[]
[]
[]
[]
[]
[]
[null,"Formato: Registro Federal de Contribuyentes de Trabajadores con Pagos Retroactivos con un Periodo Mayor a 45 días"]
[null,{"$f":"IF('Caratula Resumen'!D22=\"Elige el Periodo…\",\"\",'Caratula Resumen'!D22)","v":"Fondo de Aportaciones para la Educación Tecnológica y de Adultos/Instituto Nacional para la Educación de los Adultos (FAETA/INEA)"},null,null,null,null,null,null,null,null,null,null,null,null,null,null,null,{"$f":"IF('Caratula Resumen'!D23=\"Elige el Periodo…\",\"\",'Caratula Resumen'!D23)","v":"1er. Trimestre"}]
[]
[]
[null,"Entidad Federativa","RFC","CURP","Nombre","Clave Presupuestal",null,null,null,null,null,null,"Clave de Centro de Trabajo","Fecha de emisión de pago","Motivo del Pago Retroactivo","Periodo pagado",null,"Días transcurridos para el pago","Percepciones pagadas en el periodo reportado *"]
[null,null,null,null,null,"Partida Presupuestal","Código de Pago","Clave de Unidad","Clave de Sub Unidad","Clave de Categoría","Horas Semana Mes ","Número de Plaza",null,null,null,"Desde","Hasta"]
[]
[null,"Entidad Federativa","RFC","CURP","Nombre","Partida Presupuestal","Código de Pago","Clave de Unidad","Clave de Sub Unidad","Clave de Categoría","Horas semana mes","Número de plaza","Clave de Centro de Trabajo","Fecha de emisión de pago","Motivo del Pago Retroactivo","Periodo pagado\nDesde","Periodo pagado\nHasta","Días transcurridos para el pago","Percepciones pagadas en el periodo reportado *"]
[]
[]
[]
[]
[]
[]
[]
[null,"Total Personas : ",null,null,null,null,null,null,null,null,"Total Plazas : ",null,null,null,null,"Total Percepciones Pagadas:"]
[]
[]
[]
[null,"*Total de Percepciones reportadas por la Entidad Federativa como pagadas en el periodo "]
[null,"Fuente : Información proporcionada por las Entidades Federativas"]

{"sheet":"A Y II D4","index":3,"n_rows":46,"n_cols":21,"rows_kept":46,"cut":false,"hidden":false,"merged":[[9,1,9,6],[41,13,41,14],[12,16,13,16],[12,17,13,17],[12,20,13,20],[12,1,13,1],[12,3,13,3],[12,4,13,4],[12,5,13,5],[12,6,12,12],[12,13,12,14],[12,2,13,2],[12,18,12,19],[12,15,13,15]]}
[]
[]
[]
[]
[]
[]
[]
[]
[null,"Formato: Personal con Licencia"]
[null,{"$f":"IF('Caratula Resumen'!D22=\"Elige el Periodo…\",\"\",'Caratula Resumen'!D22)","v":"Fondo de Aportaciones para la Educación Tecnológica y de Adultos/Instituto Nacional para la Educación de los Adultos (FAETA/INEA)"},null,null,null,null,null,null,null,null,null,null,null,null,null,null,null,null,null,null,{"$f":"IF('Caratula Resumen'!D23=\"Elige el Periodo…\",\"\",'Caratula Resumen'!D23)","v":"1er. Trimestre"}]
[]
[]
[null,"Entidad Federativa","R.F.C.","CURP","NOMBRE","Clave integrada","Clave Presupuestal",null,null,null,null,null,null,"Periodo Licencia",null,"Percepciones pagadas en el Periodo de la Licencia con Presupuesto Federal*","Percepciones pagadas en el Periodo de la Licencia con Presupuesto de otra fuente*","Clave CT Origen","Licencia",null,"Descripción de la Licencia"]
[null,null,null,null,null,null,"Partida Presupuestal","Código de Pago","Clave de Unidad","Clave de Sub Unidad","Clave de Categoría","Horas Semana Mes ","Número de Plaza","Inicio","Conclusión",null,null,null,"Clave","Tipo"]
[]
[null,"Entidad Federativa","R.F.C.","CURP","NOMBRE","Clave integrada","Partida Presupuestal","Código de Pago","Clave de Unidad","Clave de Sub Unidad","Clave de Categoría","Horas Semana Mes ","Número de Plaza","Periodo Licencia\nInicio","Periodo Licencia\nConclusión","Percepciones pagadas en el Periodo de la Licencia con Presupuesto Federal*","Percepciones pagadas en el Periodo de la Licencia con Presupuesto de otra fuente*","Clave CT Origen","Licencia\nClave","Licencia\nTipo","Descripción de la Licencia"]
[null,"NAYARIT","AEMF710709245","AEMF710709MNTLRB09","ALMEJO MORENO FABIOLA","831010138T0382300.052",83101,1,3,8,"T03823",0,52,"2020-01-06","2020-01-12",4749.1499999999996,0,"18FIA0001J",22,"CON GOCE DE SUELDO","POR INCAPACIDAD MEDICA "]
[null,"NAYARIT","AEMF710709245","AEMF710709MNTLRB09","ALMEJO MORENO FABIOLA","831010138T0382300.053",83101,1,3,8,"T03824",0,52,"2020-01-13","2020-01-19",4749.1499999999996,0,"18FIA0001J",22,"CON GOCE DE SUELDO","POR INCAPACIDAD MEDICA "]
[null,"NAYARIT","AEMF710709245","AEMF710709MNTLRB09","ALMEJO MORENO FABIOLA","831010138T0382300.053",83101,1,3,8,"T03824",0,52,"2020-01-20","2020-01-26",4749.1499999999996,0,"18FIA0001J",22,"CON GOCE DE SUELDO","POR INCAPACIDAD MEDICA "]
[null,"NAYARIT","BARC731208RP3","BARC731208MNTRNN03","BARRERA RENTERIA MARIA CONCEPCION","8310101411T0382300.029",83101,1,4,11,"T03823",0,29,"2020-01-20","2020-01-20",668.99,0,"18FIA0001J",22,"CON GOCE DE SUELDO","POR INCAPACIDAD MEDICA "]
[null,"NAYARIT","FOQA671014667","FOQA671014MNTLZG06","ARIAS SIMENTAL JOSEFINA ","831010126A0180700.028",83101,1,2,6,"A01807",0,28,"2020-01-29","2020-02-04",4083.1,0,"18FIA0001J",22,"CON GOCE DE SUELDO","POR INCAPACIDAD MEDICA "]
[null,"NAYARIT","RERS631103S43","RERS631103MNTNJL01","REINOSO ROJAS SILVIA","8310101714T0382000.0165",83101,1,7,14,"T03820",0,165,"2020-01-13","2020-02-02",14202.09,0,"18FIA0001J",22,"CON GOCE DE SUELDO","POR INCAPACIDAD MEDICA "]
[null,"NAYARIT","PEHE701009N63","PEHE701009MNTRRD03","PEREZ HERNANDEZ EDNA TERESA ","8310101713T0382000.093",83101,1,7,13,"T03820",0,93,"2020-01-27","2020-02-02",4440.9399999999996,0,"18FIA0001J",22,"CON GOCE DE SUELDO","POR INCAPACIDAD MEDICA "]
[null,"NAYARIT","PEHE701009N63","PEHE701009MNTRRD03","PEREZ HERNANDEZ EDNA TERESA ","8310101713T0382000.093",83101,1,7,13,"T03820",0,93,"2020-02-03","2020-02-09",4440.9399999999996,0,"18FIA0001J",22,"CON GOCE DE SUELDO","POR INCAPACIDAD MEDICA "]
[null,"NAYARIT","FOQA671014667","FOQA671014MNTLZG06","ARIAS SIMENTAL JOSEFINA ","831010126A0180700.028",83101,1,2,6,"A01807",0,28,"2020-02-11","2020-02-17",4083.1,0,"18FIA0001J",22,"CON GOCE DE SUELDO","POR INCAPACIDAD MEDICA "]
[null,"NAYARIT","PEHE701009N63","PEHE701009MNTRRD03","PEREZ HERNANDEZ EDNA TERESA ","8310101713T0382000.093",83101,1,7,13,"T03820",0,93,"2020-02-10","2020-02-17",8881.8799999999992,0,"18FIA0001J",22,"CON GOCE DE SUELDO","POR INCAPACIDAD MEDICA "]
[null,"NAYARIT","ROIK8103229H4","ROIK810322MNTJXR05","ROJAS IÑIGUEZ KARINA LIZETH","8310101714T0382000.0304",83101,1,7,14,"T03820",0,304,"2020-02-17","2020-05-16",45265.5,0,"18FIA0001J",22,"CON GOCE DE SUELDO","POR INCAPACIDAD MEDICA "]
[null,"NAYARIT","MUPS800906NS7","MUPS800906MNTRRL09","MURILLO PORTILLO SELENE LIZETH","8310101936A0180700.023",83101,1,9,36,"A01807",0,23,"2020-03-05","2020-03-05",583.41999999999996,0,"18FIA0001J",22,"CON GOCE DE SUELDO","POR INCAPACIDAD MEDICA "]
[null,"NAYARIT","COHN840218I76","COHN840218HNTRRS08","CORTES HERNENDEZ NESTOR SIMITRIO","831010124T0380300.0321",83101,1,2,4,"T03803",0,321,"2020-03-18","2020-03-20",1323.66,0,"18FIA0001J",22,"CON GOCE DE SUELDO","POR INCAPACIDAD MEDICA "]
[null,"NAYARIT","AEMF710709245","AEMF710709MNTLRB09","ALMEJO MORENO FABIOLA","831010138T0382300.053",83101,1,3,8,"T03824",0,52,"2020-03-18","2020-03-18",2035.35,0,"18FIA0001J",22,"CON GOCE DE SUELDO","POR INCAPACIDAD MEDICA "]
[]
[]
[]
[]
[]
[]
[]
[]
[]
[]
[]
[null,"Total Personas : 11",8,null,8,null,null,null,null,null,"Total Plazas : ",null,8,"Total Pto. Federal"]
[]
[null,null,null,null,null,null,null,null,null,null,null,null,null,"Total Ppto. Otras Fuentes",null,{"$f":"SUM(P17:P43)","v":104256.42}]
[null,"*Total de Percepciones reportadas por la Entidad Federativa como pagadas al trabajador durante la Licencia."]
[null,"Fuente : Información proporcionada por las Entidades Federativas."]

{"sheet":"II B) Y 1","index":4,"n_rows":181,"n_cols":25,"rows_kept":181,"cut":false,"hidden":false,"merged":[[12,23,14,23],[13,5,13,7],[13,8,13,10],[13,11,13,13],[13,14,13,16],[13,17,13,19],[12,5,12,19],[12,20,14,20],[12,21,14,21],[12,22,14,22],[178,20,178,22],[12,3,14,3],[12,2,14,2],[12,1,14,1],[9,0,9,8],[12,0,14,0],[12,4,14,4]]}
[]
[]
[]
[]
[]
[]
[]
[]
["Formato: Plaza / Función"]
[{"$f":"IF('[1]Caratula Resumen'!D22=\"Elige el Periodo…\",\"\",'[1]Caratula Resumen'!D22)","v":"Fondo de Aportaciones para la Educación Tecnológica y de Adultos/Instituto Nacional para la Educación de los Adultos (FAETA/INEA)"},null,null,null,null,null,null,null,null,null,null,null,null,null,null,null,null,null,null,null,null,null,{"$f":"IF('Caratula Resumen'!D23=\"Elige el Periodo…\",\"\",'Caratula Resumen'!D23)","v":"1er. Trimestre"}]
[]
[]
["Entidad Federativa","RFC","CURP","Nombre","Centros de Trabajo","Plazas por tipo de función",null,null,null,null,null,null,null,null,null,null,null,null,null,null,"Total plazas Jornada","Total \nHSM","Total de Honorarios","Total de recursos presupuestales ejercidos en servicios personales en el periodo\n(2)"]
[null,null,null,null,null,"Apoyo a la labor educativa",null,null,"Administrativo y de servicio",null,null,"Docente y Apoyo Técnico Pedagógico",null,null,"Directivos y Supervisión",null,null,"Mandos medios y superiores"]
[null,null,null,null,null,"Jornada","HSM","Honorarios","Jornada","HSM","Honorarios","Jornada","HSM","Honorarios","Jornada","HSM","Honorarios","Jornada","HSM","Honorarios"]
[]
["Entidad Federativa","RFC","CURP","Nombre","Centros de Trabajo","Jornada","HSM","Honorarios","Jornada2","HSM3","Honorarios4","Jornada5","HSM6","Honorarios7","Jornada8","HSM9","Honorarios10","Jornada11","HSM12","Honorarios13","Total plazas Jornada","Total \nHSM","Total de Honorarios","Columna1","Total de recursos presupuestales ejercidos en servicios personales en el periodo\n(2)"]
["NAYARIT","AABE6103292X4","AABE610329MNTNRL06","ELIA ANDRADE BARAJAS",1,0,0,0,1,35,0,0,0,0,0,0,0,0,0,0,1,35,0,47329.43,61344.61]
["NAYARIT","AAMG630419RIA","AAMG630419MNTRRD02","MARIA GUADALUPE ARAGON MURILLO",1,0,0,0,1,35,0,0,0,0,0,0,0,0,0,0,1,35,0,61376.85,67413.2]
["NAYARIT","AEAE670823T58","AEAE670823HNTRLF06","EFRAIN ARELLANO ALATORRE",1,0,0,0,0,0,0,1,35,0,0,0,0,0,0,0,1,35,0,63599.88,82104.89]
["NAYARIT","AEMC660716HS4","AEMC660716MNTRNR04","CARMEN JULIA ARCE MONTIEL",1,0,0,0,0,0,0,1,35,0,0,0,0,0,0,0,1,35,0,63599.88,77002.23]
["NAYARIT","AEMF710709245","AEMF710709MNTLRB09","FABIOLA ALMEJO MORENO",1,0,0,0,1,35,0,0,0,0,0,0,0,0,0,0,1,35,0,61060.82,76526.66]
["NAYARIT","AERL490315IT8","AERL490315HNTRDS02","LUIS DANIEL ARREOLA RODRIGUEZ",1,0,0,0,1,35,0,0,0,0,0,0,0,0,0,0,1,35,0,47329.43,60329.01]
["NAYARIT","AESA660613253","AESA660613HNTRNN05","ANTONIO ARELIZ SANDOVAL",1,0,0,0,1,35,0,0,0,0,0,0,0,0,0,0,1,35,0,50698.14,64730.45]
["NAYARIT","AIAM561122BX1","AIAM561122HNTVVN01","MANUEL AVILA AVILA",1,0,0,0,1,35,0,0,0,0,0,0,0,0,0,0,1,35,0,44431.59,58550.66]
["NAYARIT","AIOP920903RY1","AIOP920903MNTVRL04","PALOMA LIZETH AVILA OROZCO",1,0,0,0,1,35,0,0,0,0,0,0,0,0,0,0,1,35,0,45836.9,58983.88]
["NAYARIT","AISG630112LU9","AISG630112MNTMND00","MARIA GUADALUPE AMBRIZ SANDOVAL",1,0,0,0,0,0,0,1,35,0,0,0,0,0,0,0,1,35,0,60428.71,72113.16]
["NAYARIT","AISJ700621BC9","AISJ700621MNTRMS00","JOSEFINA ARIAS SIMENTAL",1,0,0,0,1,35,0,0,0,0,0,0,0,0,0,0,1,35,0,52497.61,63781.26]
["NAYARIT","AUAP690629Q72","AUAP690629HNTGLD05","PEDRO AGUILAR ALVAREZ",1,0,0,0,1,35,0,0,0,0,0,0,0,0,0,0,1,35,0,53202.64,64224.36]
["NAYARIT","AUHT670720B63","AUHT670720MNTQRR01","TERESA AQUINO HERNANDEZ",1,0,0,0,0,0,0,1,35,0,0,0,0,0,0,0,1,35,0,64046.61,82426.97]
["NAYARIT","SANI8907293UA","SANI890729HNTLVR09","IRAN JAIR SALAZAR NAVARRO",1,0,0,0,1,35,0,0,0,0,0,0,0,0,0,0,1,35,0,49466.64]
["NAYARIT","BARC731208RP3","BARC731208MNTRNN03","MARIA CONCEPCION BARRERA RENTERIA",1,0,0,0,1,35,0,0,0,0,0,0,0,0,0,0,1,35,0,60209.91,67891.34]
["NAYARIT","CABA5502259D5","CABA550225HNTSRB09","ABEL CASTRO BERNAL",1,0,0,0,0,0,0,1,35,0,0,0,0,0,0,0,1,35,0,60331.49,72113.16]
["NAYARIT","CAGC700411BP6","CAGC700411MNTRNL05","MARIA CELINA CARRILLO GONZALEZ",1,0,0,0,1,35,0,0,0,0,0,0,0,0,0,0,1,35,0,61943.53,77661.210000000006]
["NAYARIT","CALM7004265UA","CALM700426HNTHMR08","MARCELINO CHAVEZ LAMAS",1,0,0,0,0,0,0,1,35,0,0,0,0,0,0,0,1,35,0,52583.65,65415.59]
["NAYARIT","CEHA720829FX5","CEHA720829MNTRRN03","ANGELICA MARIA CERVANTES HERNANDEZ",1,0,0,0,0,0,0,1,35,0,0,0,0,0,0,0,1,35,0,63704.97,76448.95]
["NAYARIT","COBB670422T30","COBB670422MNTVBR06","BERTHA MA. E COVARRUBIAS BOBADILLA",1,0,0,0,1,35,0,0,0,0,0,0,0,0,0,0,1,35,0,65396.05,67744.08]
["NAYARIT","COCA8507147H6","COCA850714MNTNHL04","ALBA NYDIA CONTRERAS CHAVEZ",1,0,0,0,1,35,0,0,0,0,0,0,0,0,0,0,1,35,0,40272.67,49609.55]
["NAYARIT","COEL490226TK7","COEL490226MJCRSS07","MARIA LUISA CORDERO ESPINOSA",1,0,0,0,1,35,0,0,0,0,0,0,0,0,0,0,1,35,0,44930.85,59615]
["NAYARIT","COLI660821F10","COLI660821MNTNZR04","IRMA SOFIA CONTRERAS LOZA",1,0,0,0,0,0,0,1,35,0,0,0,0,0,0,0,1,35,0,11468.51,72079.03]
["NAYARIT","DUCF820323BD2","DUCF820323HNTRCL06","FELIPE DE JESUS DURAN COCA",1,0,0,0,0,0,0,1,35,0,0,0,0,0,0,0,1,35,0,58436.03,71644.62]
["NAYARIT","DUMB660930DT3","DUMV660930MNTRNR08","BERNARDA DURAN MONTES",1,0,0,0,0,0,0,1,35,0,0,0,0,0,0,0,1,35,0,63704.97,82104.89]
["NAYARIT","EACS700505U99","EACS700505MNTSSN06","MARIA SANTOS ESTRADA CASTILLO",1,0,0,0,0,0,0,1,35,0,0,0,0,0,0,0,1,35,0,58532.45,71062.78]
["NAYARIT","EAEJ780510HC8","EAEJ780510HNTSSM08","JAIME ESTRADA ESQUIVEL",1,0,0,0,0,0,0,1,35,0,0,0,0,0,0,0,1,40,0,59802.51,73883.23]
["NAYARIT","FOQA671014667","FOQA671014MNTLZG06","AGUSTINA FLORES QUEZADA",1,0,0,0,1,35,0,0,0,0,0,0,0,0,0,0,1,35,0,48291.53,62784.37]
["NAYARIT","GABP630915IG5","GABP630915MMCRNR01","PORFIRIA GARCIA BENITEZ",1,0,0,0,0,0,0,1,35,0,0,0,0,0,0,0,1,35,0,60866.85,75347.199999999997]
["NAYARIT","GAFS8210199S8","GAFS821019HNTRRV01","SEVERO GARCIA FRANCO",1,0,0,0,1,35,0,0,0,0,0,0,0,0,0,0,1,35,0,51198.35,67672.89]
["NAYARIT","GARM740924JP4","GARM740924MNTLDR01","MARTHA ELBA GALEANA RODARTE",1,0,0,0,1,35,0,0,0,0,0,0,0,0,0,0,1,35,0,37789.440000000002,51409.9]
["NAYARIT","GOEP741023DD0","GOEP741023HNTNSR02","PORFIRIO GONZALEZ ESPERICUETA",1,0,0,0,0,0,0,1,35,0,0,0,0,0,0,0,1,35,0,61489.65,80407.679999999993]
["NAYARIT","GOMM660312R79","GOMM660312MNTMRR09 ","MARISELA GOMEZ MARISCAL",1,0,0,0,0,0,0,1,35,0,0,0,0,0,0,0,1,35,0,63021.72,76154.600000000006]
["NAYARIT","GOPE620111H24","GOPE620111HNTMRD03","EDUARDO GOMEZ PARRA",1,0,0,0,0,0,0,1,35,0,0,0,0,0,0,0,1,35,0,65089.89,78115.38]
["NAYARIT","GOPS651030PGA","GOPS651030MNTNLF04","SOFIA GONZALEZ PLAZAS",1,0,0,0,0,0,0,1,35,0,0,0,0,0,0,0,1,35,0,60744.79,73093.7]
["NAYARIT","GULM700812JK2","GULM700812MNTZPR00","MARTHA ISABEL GUZMAN LOPEZ",1,0,0,0,1,35,0,0,0,0,0,0,0,0,0,0,1,35,0,50236.68,19871.63]
["NAYARIT","GUOJ58032768A","GUOJ580327HNTTCM09","JAIME GUTIERREZ OCAMPO",1,0,0,0,0,0,0,1,35,0,0,0,0,0,0,0,1,35,0,60927.51,73928.95]
["NAYARIT","HERO590224IY6","HEXR590224MNTRXS07","ROSA MARIA HERNANDEZ",1,0,0,0,0,0,0,1,35,0,0,0,0,0,0,0,1,35,0,56952.25,70199.91]
["NAYARIT","HESR4910091U6","HESR491009MNTRNS00","MARIA DEL ROSARIO HERNANDEZ SANCHEZ",1,0,0,0,1,35,0,0,0,0,0,0,0,0,0,0,1,35,0,61060.82,75457.45]
["NAYARIT","IAHL680714P45","IAHL680714MNTBRR00 ","LORENIA CARINA IBARRA HERMOSILLO",1,0,0,0,0,0,0,1,35,0,0,0,0,0,0,0,1,35,0,58532.45,75557.440000000002]
["NAYARIT","IAMF731113NH2","IAMF731113HNTNNR04","FRANCISCO JAVIER INDA MONTEON",1,0,0,0,0,0,0,1,35,0,0,0,0,0,0,0,1,35,0,60630.33,73549.66]
["NAYARIT","ROIK8103229H4","ROIK810322MNTJXR05","KARINA LIZETH ROJAS IÑIGUEZ",1,0,0,0,0,0,0,1,35,0,0,0,0,0,0,0,1,35,0,45265.98,44544.62]
["NAYARIT","JAPA7508062F4","JAPA750806HNTCRL05","ALVARO JACOBO PEREZ",1,0,0,0,0,0,0,1,35,0,0,0,0,0,0,0,1,35,0,56952.25,69184.929999999993]
["NAYARIT","LEFE851111AZ8","LEFE851111HDFYLM03","EMMANUEL EDUARDO LEY FLORES",1,0,0,0,1,35,0,0,0,0,0,0,0,0,0,0,1,35,0,49946.64,59262.36]
["NAYARIT","LOCL770926EZ7","LOCL770926HNTPNN00","LEONARDO LOPEZ CENICEROS",1,0,0,0,0,0,0,1,35,0,0,0,0,0,0,0,1,35,0,56636.18,69066.95]
["NAYARIT","LOMJ690324HB6","LOMJ690324MNTZDS04","JOSEFINA LOZANO MEDINA",1,0,0,0,1,35,0,0,0,0,0,0,0,0,0,0,1,35,0,51936.09,68230.399999999994]
["NAYARIT","PARC930711PQ3","PARC930711HNTTBS05","CESAR IVAN PATIÑO ROBLES ",1,0,0,0,1,35,0,0,0,0,0,0,0,0,0,0,1,35,0,49466.64]
["NAYARIT","LOPO870308TGA","LOPO870308HNTPRS02","OSCAR JESUS LOPEZ PERALTA",1,0,0,0,1,35,0,0,0,0,0,0,0,0,0,0,1,35,0,38740.639999999999,53662.82]
["NAYARIT","LORE550827E17","LORE550827MNTPDM08","MA. EMMA LOPEZ RODRIGUEZ",1,0,0,0,1,35,0,0,0,0,0,0,0,0,0,0,1,35,0,49320.47,64485.43]
["NAYARIT","LOVM650308KP7","  LOVM650308HNTPLR06","MARCELINO LOPEZ VILLANUEVA",1,0,0,0,1,35,0,0,0,0,0,0,0,0,0,0,1,35,0,62106.18,78153.31]
["NAYARIT","MAFH700414PQ9","MAFH700414HNTGRC06","HECTOR JOEL MAGDALENO FRIAS",1,0,0,0,0,0,0,1,35,0,0,0,0,0,0,0,1,35,0,59164.59,71271.13]
["NAYARIT","MAIC860620U74","MAIC860620HNTCBH08","CHRISTOPHER EMMANUEL MACHUCA IBARRA",1,0,0,0,0,0,0,1,35,0,0,0,0,0,0,0,1,35,0,52991.15,66197.5]
["NAYARIT","MALL770125190","MALL770125HNTYPZ04","LAZARO MAYORQUIN LOPEZ",1,0,0,0,0,0,0,1,35,0,0,0,0,0,0,0,1,35,0,61208.49,75134.09]
["NAYARIT","MAMD710507CG4","MAMD710507MNTRRL06","DALIA CARMINA MARES MORA",1,0,0,0,1,35,0,0,0,0,0,0,0,0,0,0,1,35,0,61420.82,77440.78]
["NAYARIT","MAPL820106F29","MAPL820106HNTCNS04","LUIS RAMON MACIAS PINEDA",1,0,0,0,1,35,0,0,0,0,0,0,0,0,0,0,1,35,0,37594.080000000002,53269.9]
["NAYARIT","MAPR700819TA9","MAPR700819MPLCNQ04","RAQUEL MACIAS PINEDA",1,0,0,0,1,35,0,0,0,0,0,0,0,0,0,0,1,35,0,49896.22,65301.64]
["NAYARIT","MEFC661214GH5"," MEFC661214MNTDNR06","CRESCENCIA MEDINA FONSECA",1,0,0,0,0,0,0,1,35,0,0,0,0,0,0,0,1,35,0,65308.05,76055.27]
["NAYARIT","MEOG810220E52","MEOG810220MNTNCB06","GABRIELA MENDOZA OCHOA",1,0,0,0,1,35,0,0,0,0,0,0,0,0,0,0,1,35,0,46927.97,59404.3]
["NAYARIT","MIGG8210293G3"," MIGG821029MNTRRS05","GISELL MIRAMONTES GARCIA",1,0,0,0,1,35,0,0,0,0,0,0,0,0,0,0,1,35,0,56788.77,55825.23]
["NAYARIT","MOFM611228SA9","MOFM611228MNTNLG02","MAGDALENA MONTERO FLORES",1,0,0,0,0,0,0,1,35,0,0,0,0,0,0,0,1,35,0,62233.38,77050.52]
["NAYARIT","MOHM550119BM8","MOHI550119MNTNRD07","MA. IDELISA MONTAÑO HERNANDEZ",1,0,0,0,1,35,0,0,0,0,0,0,0,0,0,0,1,35,0,54730.14,70195.98]
["NAYARIT","MUAC7409192N3","MUAC740919MNTRNL05","CLEOPATRA MURILLO ANGELES",1,0,0,0,0,0,0,1,35,0,0,0,0,0,0,0,1,35,0,57171.07,68834.929999999993]
["NAYARIT","MUCF710407RG9","MUCF710407HNTRRR09","FRANCISCO MURILLO CORTEZ",1,0,0,0,1,35,0,0,0,0,0,0,0,0,0,0,1,35,0,47524.79,61458.33]
["NAYARIT","MUPS800906NS7","MUPS800906MNTRRL09","SELENE LIZET MURILLO PORTILLO",1,0,0,0,1,35,0,0,0,0,0,0,0,0,0,0,1,35,0,52507.87,67415.509999999995]
["NAYARIT","NARE7904024BA","NARE790402MNTVVL03","ELVIA NELLY NAVARRETE RIVERA",1,0,0,0,1,35,0,0,0,0,0,0,0,0,0,0,1,35,0,41222.6,55490.66]
["NAYARIT","NUFA521129MX9","NUFA521129MNTXRR06","ARMIDA NUÑEZ FREGOSO",1,0,0,0,1,35,0,0,0,0,0,0,0,0,0,0,1,35,0,54730.14,60931.54]
["NAYARIT","OESL430826CG0","OESL430826HJCRNR09","LORENZO ORTEGA SANCHEZ",1,0,0,0,0,0,0,1,35,0,0,0,0,0,0,0,1,35,0,56988.72,68834.929999999993]
["NAYARIT","OIAV660415J17","OIAV660415HNTRCC02","VICTORIANO ORTIZ ACOSTA",1,0,0,0,0,0,0,1,35,0,0,0,0,0,0,0,1,35,0,57171.07,68996.479999999996]
["NAYARIT","OOGR6805238P4","  OOGR680523MNTCRS03","ROSA ISELA OCHOA GARCIA",1,0,0,0,0,0,0,1,35,0,0,0,0,0,0,0,1,35,0,59869.59,71517.11]
["NAYARIT","PEHE701009N63","PEHE701009MNTRRD03","EDNA TERESA PEREZ HERNANDEZ",1,0,0,0,0,0,0,1,35,0,0,0,0,0,0,0,1,35,0,57098.13,66560.03]
["NAYARIT","PEHS760516B10","PEHS760516MNTRRL00","SILVIA CORAL PRECIADO HERNANDEZ",1,0,0,0,1,35,0,0,0,0,0,0,0,0,0,0,1,35,0,44391.55,56988.91]
["NAYARIT","OOGM580404LU3","OOGM580404MNTRMR06","MARTHA ELVA OROZCO GOMEZ",1,0,0,0,1,35,0,0,0,0,0,0,0,0,0,0,1,35,0,9819.81,71496.070000000007]
["NAYARIT","PEMM710729AV0","PEMM710729MNTRNN05","MONICA BEATRIZ PEREZ MENDOZA",1,0,0,0,0,0,0,1,35,0,0,0,0,0,0,0,1,35,0,61852.31,74516.09]
["NAYARIT","PIRA771228QN7","PIRA771228MNTNYN02","ANA RAQUEL PINTADO REYMUNDO",1,0,0,0,0,0,0,1,35,0,0,0,0,0,0,0,1,35,0,56988.72,69534.929999999993]
["NAYARIT","PORJ590620KP8","PORJ590620MNTLSS06","JOSEFINA POLANCO DE LA ROSA",1,0,0,0,0,0,0,1,35,0,0,0,0,0,0,0,1,35,0,65754.75,79026.070000000007]
["NAYARIT","PUAI760901JL8","PUAI760901HMCNVS09","ISMAEL FABRICIO PUENTES AVILA",1,0,0,0,0,0,0,1,35,0,0,0,0,0,0,0,1,35,0,65532.03,77452.86]
["NAYARIT","RABL640324JWA","RABL640324HNTNTN09","LEONARDO RANGEL BAUTISTA",1,0,0,0,0,0,0,1,35,0,0,0,0,0,0,0,1,35,0,61208.49,74815.28]
["NAYARIT","RAPM700411PL4","RAPM700411MNTMXR02","MA. MERCEDES RAMIREZ PEÑA",1,0,0,0,0,0,0,1,35,0,0,0,0,0,0,0,1,35,0,58216.46,71327.03]
["NAYARIT","RECJ660415BH6","RECJ660415MNTXHS08","MARIA DE JESUS REA CHAVEZ",1,0,0,0,0,0,0,1,35,0,0,0,0,0,0,0,1,35,0,45226.77,56711.07]
["NAYARIT","RERS631103S43","RERS631103MNTNJL01","SILVIA REINOSO ROJAS",1,0,0,0,0,0,0,1,35,0,0,0,0,0,0,0,1,35,0,60866.85,76499.679999999993]
["NAYARIT","RIJV721019740","RIJV721019MNTVCR00","VERONICA MARIA RIVAS JACOBO",1,0,0,0,0,0,0,1,35,0,0,0,0,0,0,0,1,35,0,61655.22,75253.820000000007]
["NAYARIT","ROCV411211256","ROCV411211HNTDVC01","VICENTE GUADALUPE RODRIGUEZ CUEVAS",1,0,0,0,0,0,0,1,35,0,0,0,0,0,0,0,1,35,0,58119.21,70750.23]
["NAYARIT","ROMR4701016U7","ROMR470101MJCSRS07","MARIA DEL ROSARIO ROSALES MARTINEZ",1,0,0,0,0,0,0,1,35,0,0,0,0,0,0,0,1,35,0,60007.71,71241.149999999994]
["NAYARIT","RORJ670216PM6","RORJ670216MNTDMN08","JUANA RODRIGUEZ RAMIREZ",1,0,0,0,0,0,0,1,35,0,0,0,0,0,0,0,1,35,0,51817.86,64504.03]
["NAYARIT","SARF600924RF7","SARF600924MNTLDR08","FRANCISCA SALINAS RODRIGUEZ",1,0,0,0,0,0,0,1,35,0,0,0,0,0,0,0,1,35,0,60744.79,73701.210000000006]
["NAYARIT","SAVR710307QB4","SAVR710307MNTNZS06","ROSA MARGARITA SANCHEZ VAZQUEZ",1,0,0,0,1,35,0,0,0,0,0,0,0,0,0,0,1,35,0,61158.04,76663.16]
["NAYARIT","SEMJ6202286DA","SEMJ620228HNTTRS03","J. JESUS STHEPENS MARTINEZ",1,0,0,0,1,35,0,0,0,0,0,0,0,0,0,0,1,35,0,43899.78,57002.92]
["NAYARIT","SIMG650906SD7","SIMG650906MNTLDD05","MARIA GUADALUPE SILLAS MEDINA",1,0,0,0,0,0,0,1,35,0,0,0,0,0,0,0,1,35,0,60748.59,73549.66]
["NAYARIT","TARJ6211276C6","TARJ621127HNTPMN07","JUAN CARLOS TAPIA RAMOS",1,0,0,0,0,0,0,1,35,0,0,0,0,0,0,0,1,35,0,60183.57,73817.649999999994]
["NAYARIT","UISA6804151H1","UISA680415MNTRNN07","ANASTASIA URIBE SANDOVAL",1,0,0,0,1,35,0,0,0,0,0,0,0,0,0,0,1,35,0,57266.23,72855.61]
["NAYARIT","VAFM600616B56","VAFM600616HNTLRN07","MANUEL VALDIVIA FRANCO",1,0,0,0,1,35,0,0,0,0,0,0,0,0,0,0,1,35,0,55615.82,70196.070000000007]
["NAYARIT","VAIA770111PN8","VAIA770111MNTZRD09","ADRIANA VAZQUEZ IRIARTE",1,0,0,0,1,35,0,0,0,0,0,0,0,0,0,0,1,35,0,57997.66,69133]
["NAYARIT","VAPL6101108S1","VAPL610110MNTLLL06","LILIA ANGELICA VALENCIA PLASCENCIA",1,0,0,0,1,35,0,0,0,0,0,0,0,0,0,0,1,35,0,56528.73,72713.42]
["NAYARIT","VARE720715LZ0","VARE720715MNTRMN06","ENRIQUETA VARGAS ROMERO",1,0,0,0,0,0,0,1,35,0,0,0,0,0,0,0,1,35,0,63823.23,76448.95]
["NAYARIT","VIAB780203S93","VIAB780203HNTLLS09","BASILIO VILLASEÑOR ALCANTAR",1,0,0,0,0,0,0,1,35,0,0,0,0,0,0,0,1,35,0,60630.33,73549.66]
["NAYARIT","VIVB5403237M0","VIVB540323HCMLRL07","BALDOMERO VILLANUEVA VERDUZCO",1,0,0,0,0,0,0,1,35,0,0,0,0,0,0,0,1,35,0,62338.5,75898.080000000002]
["NAYARIT","ZADS640611A57","ZADS640611MDFVRN00","MARIA SANDRA HADAID ZAVALA DUARTE",1,0,0,0,0,0,0,1,35,0,0,0,0,0,0,0,1,35,0,49484,65911.740000000005]
["NAYARIT","ZULL580228GH3","ZULL580228MDFXNR03","MARIA DE LOURDES ZUÑIGA LEON",1,0,0,0,0,0,0,1,35,0,0,0,0,0,0,0,1,35,0,57134.6,68834.929999999993]
["NAYARIT","BABM641012R5A","BABM641012MNTRRR07","MERCEDES BARRAGAN BARRIGA",1,0,1,35,0,0,0,0,0,0,0,0,0,0,0,0,1,0,1,14344.74,20719.939999999999]
["NAYARIT","LOPE790615FN1","LOPE790615HNTBNG03","EUGENIO LOBATOS PANCHO",1,0,1,35,0,0,0,0,0,0,0,0,0,0,0,0,1,0,1,14344.74,20719.939999999999]
["NAYARIT","LOCL670621BR2","LOCL670621HNTPSS00","JOSE LUIS LOPEZ CASTAÑEDA",1,0,1,35,0,0,0,0,0,0,0,0,0,0,0,0,1,0,1,14344.74,20719.939999999999]
["NAYARIT","DIFS890414J89","DIFS890414MNTSRN03","SANDY ELIZABETH DE DIOS FRANCO",1,0,1,35,0,0,0,0,0,0,0,0,0,0,0,0,1,0,1,14344.74,20719.939999999999]
["NAYARIT","RAMM850120624","RAMM850120HNTMRN08","MANUEL ANTONIO RAMOS MARQUEZ",1,0,1,35,0,0,0,0,0,0,0,0,0,0,0,0,1,0,1,14344.74,20719.939999999999]
["NAYARIT","FOMF8109082P0","FOMF810908HNTLRD09","FIDEL FLORES MARIN",1,0,1,35,0,0,0,0,0,0,0,0,0,0,0,0,1,0,1,14344.74,20719.939999999999]
["NAYARIT","EABI6702174N9","EABI670217MCCSRR09","ESPAÑA BARRERA IRMA LETICIA",1,0,1,35,0,0,0,0,0,0,0,0,0,0,0,0,1,0,1,14344.74,20719.939999999999]
["NAYARIT","PEGI6704051N2","PEGI670405HNTRNS08","PEREZ GONZALEZ MARIA ISABEL",1,0,1,35,0,0,0,0,0,0,0,0,0,0,0,0,1,0,1,14344.74,20719.939999999999]
["NAYARIT","MUAA760211IC0","MUAA760211HNTRCM09","MURILLO ACOSTA AMPELIO",1,0,1,35,0,0,0,0,0,0,0,0,0,0,0,0,1,0,1,14344.74,20719.939999999999]
["NAYARIT","CAPR660904LW1","CAPR660904MNTRRS05","CARRILLO PARTIDA ROSA MARIA",1,0,1,35,0,0,0,0,0,0,0,0,0,0,0,0,1,0,1,9563.16,20719.939999999999]
["NAYARIT","MEFJ900623F24","MEFJ900623HNTDNN09","MEDINA FONSECA JUAN CARLOS",1,0,1,35,0,0,0,0,0,0,0,0,0,0,0,0,1,0,1,14344.74]
["NAYARIT","RAAM930425JH3","RAAM930425MNTMVR03","MARISOL ANAHI RAMIREZ AVILA ",1,0,1,35,0,0,0,0,0,0,0,0,0,0,0,0,1,0,1,14344.74]
["NAYARIT","TOVY831104BU5","TOVY831104MNTRZR03","YURIDIA TORRES VAZQUEZ ",1,0,1,35,0,0,0,0,0,0,0,0,0,0,0,0,1,0,1,4781.58]
["NAYARIT ","MAOE820709BC1","MAOE820709MNTRRL06","ELVA LORENA MARQUEZ OROZCO ",1,0,0,0,0,0,0,0,0,0,0,0,0,1,40,0,1,35,0,55320.39,46295.02]
["NAYARIT","SAMA9504119YA","SAMA950411HNTLRL05","ALAN EDUARDO SALINAS MARTINEZ  ",1,0,0,0,1,40,0,0,0,0,0,0,0,0,0,0,1,35,0,23048.880000000001]
["NAYARIT ","OEGH8909064U9","OEGH890906HNTRZC02","HECTOR ALBERTO ORTEGA GUZMAN",1,0,0,0,1,35,0,0,0,0,0,0,0,0,0,0,1,35,0,40557.040000000001,55042.37]
["NAYARIT ","FALN810731E5A","FALN810731MDFRNR05","NORA EDITH FRANCO LUNA ",1,0,0,0,1,35,0,0,0,0,0,0,0,0,0,0,1,35,0,43914.89,57471.82]
["NAYARIT ","PAOK860904PU2","PAOK860904MNTRCR08","KAREN LISSETTE PARDO OCHOA",1,0,0,0,1,35,0,0,0,0,0,0,0,0,0,0,1,35,0,40296.559999999998,53019.87]
["NAYARIT ","IAAA790420LG8","IAAA790420HNTBLN02","ANTONIO IBARRA ALMARAZ",1,0,0,0,1,35,0,0,0,0,0,0,0,0,0,0,1,35,0,40596.559999999998,55632.37]
["NAYARIT ","MOFG790213LUA","MOFG790213MNTLD00","MARIA GUADALUPE MONTAÑEZ FLETES",1,0,0,0,1,35,0,0,0,0,0,0,0,0,0,0,1,35,0,34908.839999999997,57509.03]
["NAYARIT ","COHN840218I76","COHN840218HNTRRS08","NESTOR SIMITRO CORTES HERNANDEZ",1,0,0,0,1,35,0,0,0,0,0,0,0,0,0,0,1,35,0,39710.480000000003,54286.13]
["NAYARIT ","CAAY720710LWA","CAAY720710MNTRVL00","CARRILLO AVALOS YOLANDA ",1,0,0,0,1,35,0,0,0,0,0,0,0,0,0,0,1,35,0,49466.64,58875.69]
["NAYARIT ","OOCM8808119H1","OOCM880811MNTRRN02","MONICA CLARISSA OROZCO CRUZ",1,0,0,0,1,35,0,0,0,0,0,0,0,0,0,0,1,35,0,44322.15,55487.73]
["NAYARIT","GANP690420GX5","GANP690420MNTRXT06","PATRICIA GARCIA NUÑEZ ",1,0,0,0,0,0,0,0,0,0,1,40,0,0,0,0,1,40,0,200715.21,224195.03]
["NAYARIT","MARG741212515","MARG741212MNTRMD18","MARIA GUADALUPE MARTINEZ RAMOS ",1,0,0,0,0,0,0,0,0,0,0,0,0,1,40,0,1,40,0,54840.39,59889.53]
["NAYARIT","AUGW800801IE7","AUGW800801MNTGRN05","WENDY ARLENNE AGUILAR GARAY",1,0,0,0,0,0,0,1,35,0,0,0,0,0,0,0,1,35,0,54158.06,46538.87]
["NAYARIT","DUOM651107SS4","DUOM651107MNTRRR01","MARTHA LORENA DURAN OROZCO",1,0,0,0,1,35,0,0,0,0,0,0,0,0,0,0,1,35,0,47867.519999999997,41617.31]
["NAYARIT","AUZF900612KY1","AUZF900612MNTGPB08","FABIOLA  AZUCENA AGUILAR ZEPEDA",1,0,0,0,1,35,0,0,0,0,0,0,0,0,0,0,1,35,0,42209.85,38385.089999999997]
["NAYARIT","PAMK9402063H8","PAMK940206MNTRRR03","KAREN GRECIA ITZEL PARTIDA MARMOLEJO",1,0,0,0,1,35,0,0,0,0,0,0,0,0,0,0,1,35,0,39710.480000000003,35802.04]
["NAYARIT","PEFG900607MC1","PEFG900607MNTRLR04","MARIA GRACIELA PEREZ FLORES",1,0,0,0,1,35,0,0,0,0,0,0,0,0,0,0,1,35,0,36465.33,36152.04]
["NAYARIT","GOHS820825LT2","GOHS820825MNTNRL02","GONZALEZ HERNANDEZ SOLEDAD ",1,0,0,0,1,35,0,0,0,0,0,0,0,0,0,0,1,35,0,37477.620000000003]
["NAYARIT","MIAC880412U2A","MIAC880412MNTNGR00","MINJARES AGUILAR CARMEN EUGENIA",1,0,0,0,1,35,0,0,0,0,0,0,0,0,0,0,1,35,0,36465.33]
["NAYARIT","AATJ8211206T9","AATJ821120MNTLR01","ALDACO TORRES JANETH YAHAIRA",1,0,0,0,0,0,0,1,35,0,0,0,0,0,0,0,1,35,0,47196.61]
["NAYARIT","NUOL790816HL2","NUOL790816MNTXRZ00","LIZETH DEL ROCIO NUÑEZ ORTEGA ",1,0,0,0,1,0,0,0,0,0,0,0,0,1,40,0,1,40,0,54840.39,59889.53]
["NAYARIT","OOGV931204UX8","OOGV931204HNTCRC09","VICENTE OCHOA GARCIA",1,0,0,0,1,40,0,0,0,0,0,0,0,0,0,0,1,35,0,16444.439999999999]
["NAYARIT","MOOM870801V58","MOOM870801HNTNRR01","MARIANO ENRIQUE MONTERO ORTEGA",1,0,0,0,0,0,0,0,0,0,0,0,0,1,40,0,1,40,0,54840.39]
["NAYARIT","MEVA810103318","MEVA810103HNTZLB07","ABEL MEZA DEL VALLE",1,0,0,0,0,0,0,0,0,0,0,0,0,1,40,0,1,40,0,54840.45]
["NAYARIT","AAGD8310245TA","AAGD831024HNTYRN07","DANIEL ENRIQUE AYALA GARCIA",1,0,0,0,0,0,0,0,0,0,0,0,0,1,40,0,1,40,0,54840.45]
["NAYARIT","GOMJ751008TZA","GOMJ751008HNTNRL06","JULIO CESAR GONZALEZ MORENO",1,0,0,0,0,0,0,0,0,0,0,0,0,1,40,0,1,40,0,54840.45,58465.01]
["NAYARIT","CEGY820421KN7","CEGY820421MNTJRS03","YESENIA YANETH CEJA GARCIA",1,0,0,0,0,0,0,0,0,0,0,0,0,1,40,0,1,40,0,54840.45,39421.68]
["NAYARIT","MAOA780907LV5","MAOA780907HNTCRL08","JOSE ALBERTO MACEDO ORTEGA ",1,0,0,0,0,0,0,0,0,0,0,0,0,1,40,0,1,40,0,1046.67,39421.64]
["NAYARIT","GALA860819222","GALA860819MJCRRN05","ANGELICA MARIA GUADALUPE GARCIA LOERA",1,0,0,0,1,40,0,0,0,0,0,0,0,0,0,0,1,35,0,49466.64]
["NAYARIT","SESN8801138H9","SESN880113MNTPNN09","SEPULVEDA SANDOVAL NANCY THALIA",1,0,0,0,1,35,0,0,0,0,0,0,0,0,0,0,1,35,0,44376.38]
["NAYARIT","CAGS9102045J1","CAGS910204MNTRNT07","CARRILLO GONZALEZ STEPHANIE",1,0,0,0,1,35,0,0,0,0,0,0,0,0,0,0,1,35,0,35509.71]
["NAYARIT","GUBJ8403153GA","GUBJ840315MNTTRS06                                                                                                                                                                                                                                           ","GUTIERREZ BERNAL JOSELIN DEL CARMEN",1,0,0,0,1,40,0,0,0,0,0,0,0,0,0,0,1,40,0,54797.53]
["NAYARIT","SAPC9205035G0","SAPC920503MNTNLN03","SANTANA POLANCO CINTHIA DANIELA",1,0,0,0,1,40,0,0,0,0,0,0,0,0,0,0,1,40,0,42875.38]
["NAYARIT","ROCO870109C61","ROCO870109HNTBRS08","ROBLES CORDERO OSCAR HUMBERTO",1,0,0,0,1,35,0,0,0,0,0,0,0,0,0,0,1,35,0,35509.71]
["NAYARIT","CAFJ920621U84","CAFJ920621MNTRLL08","CARRILLO FLORES JULIA DEL CARMEN",1,0,0,0,1,35,0,0,0,0,0,0,0,0,0,0,1,35,0,35509.71]
["NAYARIT","BUBA831109E36","BUBA831109MNTSRN01","BUSTAMANTE BORRAYO ANA RUTH",1,0,0,0,1,40,0,0,0,0,0,0,0,0,0,0,1,40,0,40536.379999999997]
["NAYARIT","JIRK960721P84","JIRK960721MBCMZT05","JIMENEZ RUIZ KATIA FERNANDA",1,0,0,0,1,35,0,0,0,0,0,0,0,0,0,0,1,35,0,35509.71]
["NAYARIT","UIIL750709IJ9","UIIL750709MNTRBV05","URIBE IBARRA LIVIER",1,0,0,0,1,40,0,0,0,0,0,0,0,0,0,0,1,40,0,54407.39]
["NAYARIT","QUNL8911244Q6","QUNL891124MNTRXS06","QUIROGA NUÑEZ LESLIE GABRIELA",1,0,0,0,1,35,0,0,0,0,0,0,0,0,0,0,1,35,0,37173.18]
["NAYARIT","MAML0011014V6","MAML001101HNTYDZA3","MAYORQUIN MEDINA LAZARO JOSEHANGEL",1,0,0,0,0,35,0,0,0,0,0,0,0,0,0,0,1,35,0,35287.410000000003]
["NAYARIT","BAMJ921231AL0","BAMJ921231HNTRRS04","BARRIOS MORA JESUS ARMANDO",1,0,0,0,0,35,0,0,0,0,0,0,0,0,0,0,1,35,0,33134.19]
["NAYARIT","LOZY811228DK1","LOZY811228MNTPVD01","LOPEZ ZAVALA YADIRA ALEJANDRA",1,0,0,0,0,35,0,0,0,0,0,0,0,0,0,0,1,35,0,33134.19]
["NAYARIT","AAUB980612QV5","AAUB980612MNTVRR02","AVALOS URIBE BRISA ALEJANDRA",1,0,0,0,1,35,0,0,0,0,0,0,0,0,0,0,1,35,0,39561.64]
["NAYARIT","MAAK930122C18","MAAK930122MNTRLR05","MARTINEZ ALMEJO KAREN ABIGAIL",1,0,0,0,0,35,0,0,0,0,0,0,0,0,0,0,1,35,0,33134.19]
["NAYARIT","RATV791021AJ6","RATV791021HNTMPC03","RAMIREZ TOPETE  VICTOR JAVIER",1,0,0,0,0,35,0,0,0,0,0,0,0,0,0,0,1,35,0,54143.57]
["NAYARIT","DEPE9006239M6","DEPE900623HNTLXN06","DELGADO PEÑA ENRIQUE",1,0,0,0,0,40,0,0,0,0,0,0,0,0,0,0,1,40,0,33022.199999999997]
["NAYARIT","FAMM9508109Q2","FAMM950810MNTRNY05","FRANCO MONROY MIRIAM ANGELICA ",1,0,0,0,0,40,0,0,0,0,0,0,0,0,0,0,1,40,0,26417.759999999998]
["NAYARIT","HIEL8602266Y1","HIEL860226HNTDSS08","HIDALGO ESCOBAR LUIS ALBERTO",1,0,0,0,0,35,0,0,0,0,0,0,0,0,0,0,1,35,0,5617.51]
[null,null,null,null,null,null,null,null,null,null,null,null,null,null,null,null,null,null,null,null,null,null,null,{"$f":"SUM(X18:X176)","v":7672029.0800000038}]
[]
["Total Personas : ",159,null,null,null,null,null,null,null,null,null,null,null,null,null,null,null,null,null,null,"Total Recursos Ejercidos:"]
[]
["Fuente : Información proporcionada por las Entidades Federativas."]

{"sheet":"II C y 1_","index":5,"n_rows":178,"n_cols":21,"rows_kept":178,"cut":false,"hidden":false,"merged":[[8,0,8,7],[11,0,12,0],[11,1,12,1],[11,4,12,4],[11,19,12,19],[11,5,12,5],[11,6,12,6],[11,17,11,18],[11,2,12,2],[11,3,12,3],[11,20,12,20],[11,7,12,7],[11,8,11,14],[11,15,12,15],[11,16,12,16]]}
[]
[]
[]
[]
[]
[]
[]
["Formato: Personal Federalizado por Registro Federal de Contribuyentes"]
[{"$f":"IF('Caratula Resumen'!D22=\"Elige el Periodo…\",\"\",'Caratula Resumen'!D22)","v":"Fondo de Aportaciones para la Educación Tecnológica y de Adultos/Instituto Nacional para la Educación de los Adultos (FAETA/INEA)"},null,null,null,null,null,null,null,null,null,null,null,null,null,null,null,null,null,null,{"$f":"IF('Caratula Resumen'!D23=\"Elige el Periodo…\",\"\",'Caratula Resumen'!D23)","v":"1er. Trimestre"}]
[]
[]
["Entidad Federativa","Clave CT","Turno","RFC","CURP","Nombre","Funcion Real","Horas que labora en el Centro de Trabajo","Clave Presupuestal",null,null,null,null,null,null,"Tipo de Categoría","Identificador de Contrato de Honorarios","Periodo de efecto de pago en el trimestre",null,"Percepciones pagadas en el Periodo de Comisión con Presupuesto Federal*","Percepciones pagadas en el Periodo de Comisión con Presupuesto de otra fuente*"]
[null,null,null,null,null,null,null,null,"Partida Presupuestal","Código de Pago","Clave de Unidad","Clave de Sub Unidad","Clave de Categoría","Horas Semana Mes ","Número de Plaza",null,null,"Inicial","Termino"]
[]
["Entidad Federativa","Clave CT","Turno","RFC","CURP","Nombre","Funcion Real","Horas que labora en el Centro de Trabajo","Partida Presupuestal","Código de Pago","Clave de Unidad","Clave de Sub Unidad","Clave de Categoría","Horas semana mes","Número de plaza","Tipo de Categoría","Identificador de Contrato de Honorarios","Periodo de efecto de pago en el trimestre\nInicial","Periodo de efecto de pago en el trimestre\nTermino","Percepciones pagadas en el Periodo de Comisión con Presupuesto Federal*","Percepciones pagadas en el Periodo de Comisión con Presupuesto de otra fuente*"]
["NAYARIT","18FIA0001J",100,"AABE6103292X4","AABE610329MNTNRL06","ELIA ANDRADE BARAJAS","TECNICO MEDIO",35,83101,1,9,36,"T03803",0,35,2,null,20200101,20200331,47329.43]
["NAYARIT","18FIA0001J",100,"AAMG630419R1A","AAMG630419MNTRRD02","MARIA GUADALUPE ARAGON MURILLO","JEFE DE OFICINA",35,83101,1,2,5,"A01807",0,49,5,null,20200101,20200331,61376.85]
["NAYARIT","18FIA0001J",100,"AEAE670823T58","AEAE670823HNTRLF06","EFRAIN ARELLANO ALATORRE","TECNICO DOCENTE",35,83101,1,7,17,"T03820",0,101,7,null,20200101,20200331,63599.88]
["NAYARIT","18FIA0001J",100,"AEMC660716HS4","AEMC660716MNTRNR04","CARMEN JULIA ARCE MONTIEL","TECNICO DOCENTE",35,83101,1,7,12,"T03820",0,69,7,null,20200101,20200331,63599.88]
["NAYARIT","18FIA0001J",100,"AEMF710709245","AEMF710709MNTLRB09","FABIOLA ALMEJO MORENO","TECNICO SUPERIOR",35,83101,1,3,8,"T03823",0,52,7,null,20200101,20200331,61060.82]
["NAYARIT","18FIA0001J",100,"AERL490315IT8","AERL490315HNTRDS02","LUIS DANIEL ARREOLA RODRIGUEZ","ADMINISTRATIVO ESPECIALIZADOS",35,83101,1,9,35,"A01803",0,18,2,null,20200101,20200331,47329.43]
["NAYARIT","18FIA0001J",100,"AESA660613253","AESA660613HNTRNN05","ANTONIO ARELIZ SANDOVAL","TECNICO MEDIO",35,83101,1,9,36,"T03803",0,17,2,null,20200101,20200331,50698.14]
["NAYARIT","18FIA0001J",100,"AIAM561122BX1","AIAM561122HNTVVN01","MANUEL AVILA AVILA","TECNICO MEDIO",35,83101,1,9,35,"T03803",0,19,2,null,20200101,20200331,44431.59]
["NAYARIT","18FIA0001J",100,"AIOP920903RY1","AIOP920903MNTVRL04","PALOMA LIZETH AVILA OROZCO","JEFA DE OFICINA ",35,83101,1,2,6,"A01806",0,262,3,null,20200101,20200331,45836.9]
["NAYARIT","18FIA0001J",100,"AISG630112LU9","AISG630112MNTMND00","MARIA GUADALUPE AMBRIZ SANDOVAL","TECNICO DOCENTE",35,83101,1,7,14,"T03820",0,100,7,null,20200101,20200331,60428.71]
["NAYARIT","18FIA0001J",100,"AISJ700621BC9","AISJ700621MNTRMS00","JOSEFINA ARIAS SIMENTAL","JEFE DE OFICINA",35,83101,1,2,6,"A01807",0,28,5,null,20200101,20200331,52497.61]
["NAYARIT","18FIA0001J",100,"AUAP690629Q72","AUAP690629HNTGLD05","PEDRO AGUILAR ALVAREZ","SECRETARIA C",35,83101,1,7,13,"A03804",0,79,2,null,20200101,20200331,53202.64]
["NAYARIT","18FIA0001J",100,"AUHT670720B63","AUHT670720MNTQRR01","TERESA AQUINO HERNANDEZ","TECNICO DOCENTE",35,83101,1,7,16,"T03820",0,132,7,null,20200101,20200331,64046.61]
["NAYARIT","18FIA0001J",100,"SANI8907293UA","SANI890729HNTLVR09","IRAN JAIR SALAZAR NAVARRO","COORD. DE SERVICIOS ESP.",35,83101,1,3,9,"CF33849",0,365,8,null,20200101,20200331,49466.64]
["NAYARIT","18FIA0001J",100,"BARC731208RP3","BARC731208MNTRNN03","MARIA CONCEPCION BARRERA RENTERIA","TECNICO SUPERIOR",35,83101,1,4,11,"T03823",0,29,7,null,20200101,20200331,60209.91]
["NAYARIT","18FIA0001J",100,"CABA5502259D5","CABA550225HNTSRB09","ABEL CASTRO BERNAL","TECNICO DOCENTE",35,83101,1,7,14,"T03820",0,102,7,null,20200101,20200331,60331.49]
["NAYARIT","18FIA0001J",100,"CAGC700411BP6","CAGC700411MNTRNL05","MARIA CELINA CARRILLO GONZALEZ","TECNICO SUPERIOR",35,83101,1,8,29,"T03823",0,41,7,null,20200101,20200331,61943.53]
["NAYARIT","18FIA0001J",100,"CALM7004265UA","CALM700426HNTHMR08","MARCELINO CHAVEZ LAMAS","TECNICO DOCENTE",35,83101,1,7,13,"T03820",0,174,7,null,20200101,20200331,52583.65]
["NAYARIT","18FIA0001J",100,"CEHA720829FX5","CEHA720829MNTRRN03","ANGELICA MARIA CERVANTES HERNANDEZ","TECNICO DOCENTE",35,83101,1,7,13,"T03820",0,83,7,null,20200101,20200331,63704.97]
["NAYARIT","18FIA0001J",100,"COBB670422T30","COBB670422MNTVBR06","BERTHA MA. E COVARRUBIAS BOBADILLA","TECNICO SUPERIOR",35,83101,1,8,29,"A01807",0,36,5,null,20200101,20200331,65396.05]
["NAYARIT","18FIA0001J",100,"COCA8507147H6","COCA850714MNTNHL04","ALBA NYDIA CONTRERAS CHAVEZ","JEFE D E OFICINA",35,83101,1,2,4,"A01807",0,261,5,null,20200101,20200331,40272.67]
["NAYARIT","18FIA0001J",100,"COEL490226TK7","COEL490226MJCRSS07","MARIA LUISA CORDERO ESPINOSA","SECRETARIA C",35,83101,1,2,6,"A03804",0,54,2,null,20200101,20200331,44930.85]
["NAYARIT","18FIA0001J",100,"COLI660821F10","COLI660821MNTNZR04","IRMA SOFIA CONTRERAS LOZA","TECNICO DOCENTE",35,83101,1,7,14,"T03820",0,105,7,null,20191231,20191231,11468.51]
["NAYARIT","18FIA0001J",100,"DUCF820323BD2","DUCF820323HNTRCL06","FELIPE DE JESUS DURAN COCA","TECNICO DOCENTE",35,83101,1,7,14,"T03820",0,241,7,null,20200101,20200331,58436.03]
["NAYARIT","18FIA0001J",100,"DUMB660930DT3","DUMV660930MNTRNR08","BERNARDA DURAN MONTES","TECNICO DOCENTE",35,83101,1,7,17,"T03820",0,144,7,null,20200101,20200331,63704.97]
["NAYARIT","18FIA0001J",100,"EACS700505U99","EACS700505MNTSSN06","MARIA SANTOS ESTRADA CASTILLO","TECNICO DOCENTE",35,83101,1,7,13,"T03820",0,84,7,null,20200101,20200331,58532.45]
["NAYARIT","18FIA0001J",100,"EAEJ780510HC8","EAEJ780510HNTSSM08","JAIME ESTRADA ESQUIVEL","TECNICO DOCENTE",35,83101,1,7,13,"T03820",0,191,7,null,20200101,20200331,59802.51]
["NAYARIT","18FIA0001J",100,"FOQA671014667","FOQA671014MNTLZG06","AGUSTINA FLORES QUEZADA","ANALISTA ADMINISTRATIVO",35,83101,1,7,14,"A01806",0,107,3,null,20200101,20200331,48291.53]
["NAYARIT","18FIA0001J",100,"GABP630915IG5","GABP630915MMCRNR01","PORFIRIA GARCIA BENITEZ","TECNICO DOCENTE",35,83101,1,7,15,"T03820",0,163,7,null,20200101,20200331,60866.85]
["NAYARIT","18FIA0001J",100,"GAFS8210199S8","GAFS821019HNTRRV01","SEVERO GARCIA FRANCO","ADMINISTRATIVO ESPECIALIZADOS",35,83101,1,8,28,"A01803",0,172,2,null,20200101,20200331,51198.35]
["NAYARIT","18FIA0001J",100,"GARM740924JP4","GARM740924MNTLDR01","MARTHA ELBA GALEANA RODARTE","SECRETARIA C",35,83101,1,9,35,"A03804",0,293,2,null,20200101,20200331,37789.440000000002]
["NAYARIT","18FIA0001J",100,"GOEP741023DD0","GOEP741023HNTNSR02","PORFIRIO GONZALEZ ESPERICUETA","TECNICO DOCENTE",35,83101,1,7,17,"T03820",0,145,7,null,20200101,20200331,61489.65]
["NAYARIT","18FIA0001J",100,"GOMM660312R79","GOMM660312MNTMRR09 ","MARISELA GOMEZ MARISCAL","TECNICO DOCENTE",35,83101,1,7,13,"T03820",0,86,7,null,20200101,20200331,63021.72]
["NAYARIT","18FIA0001J",100,"GOPE620111H24","GOPE620111HNTMRD03","EDUARDO GOMEZ PARRA","TECNICO DOCENTE",35,83101,1,7,15,"T03820",0,121,7,null,20200101,20200331,65089.89]
["NAYARIT","18FIA0001J",100,"GOPS651030PGA","GOPS651030MNTNLF04","SOFIA GONZALEZ PLAZAS","TECNICO DOCENTE",35,83101,1,7,13,"T03820",0,87,7,null,20200101,20200331,60744.79]
["NAYARIT","18FIA0001J",100,"GULM700812JK2","GULM700812MNTZPR00","MARTHA ISABEL GUZMAN LOPEZ","ANALISTA ADMINISTRATIVO",35,83101,1,8,27,"A01806",0,42,3,null,20200101,20200331,50236.68]
["NAYARIT","18FIA0001J",100,"GUOJ58032768A","GUOJ580327HNTTCM09","JAIME GUTIERREZ OCAMPO","TECNICO DOCENTE",35,83101,1,7,14,"T03820",0,109,7,null,20200101,20200331,60927.51]
["NAYARIT","18FIA0001J",100,"HERO590224IY6","HEXR590224MNTRXS07","ROSA MARIA HERNANDEZ","TECNICO DOCENTE",35,83101,1,7,13,"T03820",0,154,7,null,20200101,20200331,56952.25," "]
["NAYARIT","18FIA0001J",100,"HESR4910091U6","HESR491009MNTRNS00","MARIA DEL ROSARIO HERNANDEZ SANCHEZ","TECNICO SUPERIOR",35,83101,1,3,9,"T03823",0,63,7,null,20200101,20200331,61060.82]
["NAYARIT","18FIA0001J",100,"IAHL680714P45","IAHL680714MNTBRR00 ","LORENIA CARINA IBARRA HERMOSILLO","TECNICO DOCENTE",35,83101,1,7,16,"T03820",0,31,7,null,20200101,20200331,58532.45]
["NAYARIT","18FIA0001J",100,"IAMF731113NH2","IAMF731113HNTNNR04","FRANCISCO JAVIER INDA MONTEON","TECNICO DOCENTE",35,83101,1,7,15,"T03820",0,171,7,null,20200101,20200331,60630.33]
["NAYARIT","18FIA0001J",100,"ROIK8103229H4","ROIK810322MNTJXR05","KARINA LIZETH ROJAS IÑIGUEZ","TECNICO DOCENTE",35,83101,1,7,14,"T03820",0,304,7,null,20200101,20200331,45265.98]
["NAYARIT","18FIA0001J",100,"JAPA7508062F4","JAPA750806HNTCRL05","ALVARO JACOBO PEREZ","TECNICO DOCENTE",35,83101,1,7,16,"T03820",0,157,7,null,20200101,20200331,56952.25]
["NAYARIT","18FIA0001J",100,"LEFE851111AZ8","LEFE851111HDFYLM03","EMMANUEL EDUARDO LEY FLORES","COORDINADOR DE SERV. ESP.",35,83101,1,8,32,"CF33849",0,292,8,null,20200101,20200331,49946.64]
["NAYARIT","18FIA0001J",100,"LOCL770926EZ7","LICL900704MJCMRR03","LEONARDO LOPEZ CENICEROS","TECNICO DOCENTE",35,83101,1,7,13,"T03820",0,175,7,null,20200101,20200331,56636.18]
["NAYARIT","18FIA0001J",100,"LOMJ690324HB6","LOMJ690324MNTZDS04","JOSEFINA LOZANO MEDINA","ANALISTA ADMINISTRATIVO",35,83101,1,7,12,"A01806",0,72,3,null,20200101,20200331,51936.09]
["NAYARIT","18FIA0001J",100,"PARC930711PQ3","PARC930711HNTTBS05","CESAR IVAN PATIÑO ROBLES ","COORDINADOR DE SERV. ESP.",35,83101,1,2,5,"CF33849",0,360,8,null,20200101,20200331,49466.64]
["NAYARIT","18FIA0001J",100,"LOPO870308TGA","LOPO870308HNTPRS02","OSCAR JESUS LOPEZ PERALTA","OFICIAL DE SERV. Y  MANTENIMIENTO ",35,83101,1,9,35,"S01803",0,260,2,null,20200101,20200331,38740.639999999999]
["NAYARIT","18FIA0001J",100,"LORE550827E17","LORE550827MNTPDM08","MA. EMMA LOPEZ RODRIGUEZ","JEFE DE OFICINA",35,83101,1,2,4,"A01807",0,1,5,null,20200101,20200331,49320.47]
["NAYARIT","18FIA0001J",100,"LOVM650308KP7","  LOVM650308HNTPLR06","MARCELINO LOPEZ VILLANUEVA","TECNICO SUPERIOR",35,83101,1,9,34,"T03823",0,51,7,null,20200101,20200331,62106.18]
["NAYARIT","18FIA0001J",100,"MAFH700414PQ9","MAFH700414HNTGRC06","HECTOR JOEL MAGDALENO FRIAS","TECNICO DOCENTE",35,83101,1,7,13,"T03820",0,91,7,null,20200101,20200331,59164.59]
["NAYARIT","18FIA0001J",100,"MAIC860620U74","MAIC860620HNTCBH08","CHRISTOPHER EMMANUEL MACHUCA IBARRA","TECNICO DOCENTE",35,83101,1,7,15,"T03820",0,279,7,null,20200101,20200331,52991.15]
["NAYARIT","18FIA0001J",100,"MALL770125190","MALL770125HNTYPZ04","LAZARO MAYORQUIN LOPEZ","TECNICO DOCENTE",35,83101,1,7,12,"T03820",0,111,7,null,20200101,20200331,61208.49]
["NAYARIT","18FIA0001J",100,"MAMD710507CG4","MAMD710507MNTRRL06","DALIA CARMINA MARES MORA","TECNICO SUPERIOR",35,83101,1,8,28,"T03823",0,55,7,null,20200101,20200331,61420.82]
["NAYARIT","18FIA0001J",100,"MAPL820106F29","MAPL820106HNTCNS04","LUIS RAMON MACIAS PINEDA","SECRETARIA C",35,83101,1,9,35,"A03804",0,296,2,null,20200101,20200331,37594.080000000002]
["NAYARIT","18FIA0001J",100,"MAPR700819TA9","MAPR700819MPLCNQ04","RAQUEL MACIAS PINEDA","JEFE DE OFICINA",35,83101,1,9,35,"A01807",0,9,5,null,20200101,20200331,49896.22]
["NAYARIT","18FIA0001J",100,"MEFC661214GH5"," MEFC661214MNTDNR06","CRESCENCIA MEDINA FONSECA","TECNICO DOCENTE",35,83101,1,7,12,"T03820",0,73,2,null,20200101,20200331,65308.05]
["NAYARIT","18FIA0001J",100,"MEOG810220E52","MEOG810220MNTNCB06","GABRIELA MENDOZA OCHOA","TECNICO MEDIO",35,83101,1,9,34,"T03803",0,294,2,null,20200101,20200331,46927.97]
["NAYARIT","18FIA0001J",100,"MIGG8210293G3"," MIGG821029MNTRRS05","GISELL MIRAMONTES GARCIA","TECNICO SUPERIOR",35,83101,1,8,31,"T03823",0,6,7,null,20200101,20200331,56788.77]
["NAYARIT","18FIA0001J",100,"MOFM611228SA9","MOFM611228MNTNLG02","MAGDALENA MONTERO FLORES","TECNICO DOCENTE",35,83101,1,7,16,"T03820",0,137,7,null,20200101,20200331,62233.38]
["NAYARIT","18FIA0001J",100,"MOHM550119BM8","MOHI550119MNTNRD07","MA. IDELISA MONTAÑO HERNANDEZ","JEFE DE OFICINA",35,83101,1,2,6,"A01807",0,56,5,null,20200101,20200331,54730.14]
["NAYARIT","18FIA0001J",100,"MUAC7409192N3","MUAC740919MNTRNL05","CLEOPATRA MURILLO ANGELES","TECNICO DOCENTE",35,83101,1,7,13,"T03820",0,92,7,null,20200101,20200331,57171.07]
["NAYARIT","18FIA0001J",100,"MUCF710407RG9","MUCF710407HNTRRR09","FRANCISCO MURILLO CORTEZ","ESPECIALISTA EN PROYECTOS",35,83101,1,9,34,"T03810",0,14,2,null,20200101,20200331,47524.79]
["NAYARIT","18FIA0001J",100,"MUPS800906NS7","MUPS800906MNTRRL09","SELENE LIZET MURILLO PORTILLO","TECNICO DOCENTE",35,83101,1,9,36,"A01807",0,23,7,null,20200101,20200331,52507.87]
["NAYARIT","18FIA0001J",100,"NARE7904024BA","NARE790402MNTVVL03","ELVIA NELLY NAVARRETE RIVERA","ANALISTA ADMINISTRATIVO",35,83101,1,9,35,"A01805",0,283,3,null,20200101,20200331,41222.6]
["NAYARIT","18FIA0001J",100,"NUFA521129MX9","NUFA521129MNTXRR06","ARMIDA NUÑEZ FREGOSO","JEFE DE OFICINA",35,83101,1,3,10,"A01807",0,68,5,null,20200101,20200331,54730.14]
["NAYARIT","18FIA0001J",100,"OESL430826CG0","OESL430826HJCRNR09","LORENZO ORTEGA SANCHEZ","TECNICO DOCENTE",35,83101,1,7,14,"T03820",0,150,7,null,20200101,20200331,56988.72]
["NAYARIT","18FIA0001J",100,"OIAV660415J17","OIAV660415HNTRCC02","VICTORIANO ORTIZ ACOSTA","TECNICO DOCENTE",35,83101,1,7,14,"T03820",0,114,7,null,20200101,20200331,57171.07]
["NAYARIT","18FIA0001J",100,"OOGR6805238P4","  OOGR680523MNTCRS03","ROSA ISELA OCHOA GARCIA","TECNICO DOCENTE",35,83101,1,7,14,"T03820",0,15,7,null,20200101,20200331,59869.59]
["NAYARIT","18FIA0001J",100,"PEHE701009N63","PEHE701009MNTRRD03","EDNA TERESA PEREZ HERNANDEZ","TECNICO DOCENTE",35,83101,1,7,13,"T03820",0,93,7,null,20200101,20200331,57098.13]
["NAYARIT","18FIA0001J",100,"PEHS760516B10","PEHS760516MNTRRL00","SILVIA CORAL PRECIADO HERNANDEZ","SECRETARIA C",35,83101,1,8,28,"A03804",0,244,2,null,20200101,20200331,44391.55]
["NAYARIT","18FIA0001J",100,"OOGM580404LU3","OOGM580404MNTRMR06","MARTHA ELVA OROZCO GOMEZ","JEFE DE OFICINA",35,83101,1,9,36,"A01807",0,32,5,null,20191231,20191231,9819.81]
["NAYARIT","18FIA0001J",100,"PEMM710729AV0","PEMM710729MNTRNN05","MONICA BEATRIZ PEREZ MENDOZA","TECNICO DOCENTE",35,83101,1,7,15,"T03820",0,75,7,null,20200101,20200331,61852.31]
["NAYARIT","18FIA0001J",100,"PIRA771228QN7","PIRA771228MNTNYN02","ANA RAQUEL PINTADO REYMUNDO","TECNICO DOCENTE",35,83101,1,7,14,"T03820",0,149,7,null,20200101,20200331,56988.72]
["NAYARIT","18FIA0001J",100,"PORJ590620KP8","PORJ590620MNTLSS06","JOSEFINA POLANCO DE LA ROSA","TECNICO DOCENTE",35,83101,1,7,14,"T03820",0,39,7,null,20200101,20200331,65754.75]
["NAYARIT","18FIA0001J",100,"PUAI760901JL8","PUAI760901HMCNVS09","ISMAEL FABRICIO PUENTES AVILA","TECNICO DOCENTE",35,83101,1,7,15,"T03820",0,161,7,null,20200101,20200331,65532.03]
["NAYARIT","18FIA0001J",100,"RABL640324JWA","RABL640324HNTNTN09","LEONARDO RANGEL BAUTISTA","TECNICO DOCENTE",35,83101,1,7,16,"T03820",0,139,7,null,20200101,20200331,61208.49]
["NAYARIT","18FIA0001J",100,"RAPM700411PL4","RAPM700411MNTMXR02","MA. MERCEDES RAMIREZ PEÑA","TECNICO DOCENTE",35,83101,1,7,15,"T03820",0,129,7,null,20200101,20200331,58216.46]
["NAYARIT","18FIA0001J",100,"RECJ660415BH6","RECJ660415MNTXHS08","MARIA DE JESUS REA CHAVEZ","TECNICO DOCENTE",35,83101,1,7,13,"T03820",0,330,7,null,20200101,20200331,45226.77]
["NAYARIT","18FIA0001J",100,"RERS631103S43","RERS631103MNTNJL01","SILVIA REINOSO ROJAS","TECNICO DOCENTE",35,83101,1,7,14,"T03820",0,165,7,null,20200101,20200331,60866.85]
["NAYARIT","18FIA0001J",100,"RIJV721019740","RIJV721019MNTVCR00","VERONICA MARIA RIVAS JACOBO","TECNICO DOCENTE",35,83101,1,7,16,"T03820",0,147,7,null,20200101,20200331,61655.22]
["NAYARIT","18FIA0001J",100,"ROCV411211256","ROCV411211HNTDVC01","VICENTE GUADALUPE RODRIGUEZ CUEVAS","TECNICO DOCENTE",35,83101,1,7,14,"T03820",0,76,7,null,20200101,20200331,58119.21]
["NAYARIT","18FIA0001J",100,"ROMR4701016U7","ROMR470101MJCSRS07","MARIA DEL ROSARIO ROSALES MARTINEZ","TECNICO DOCENTE",35,83101,1,7,14,"T03820",0,116,7,null,20200101,20200331,60007.71]
["NAYARIT","18FIA0001J",100,"RORJ670216PM6","RORJ670216MNTDMN08","JUANA RODRIGUEZ RAMIREZ","TECNICO DOCENTE",35,83101,1,7,15,"T03820",0,186,7,null,20200101,20200331,51817.86]
["NAYARIT","18FIA0001J",100,"SARF600924RF7","SARF600924MNTLDR08","FRANCISCA SALINAS RODRIGUEZ","TECNICO DOCENTE",35,83101,1,7,14,"T03820",0,117,7,null,20200101,20200331,60744.79]
["NAYARIT","18FIA0001J",100,"SAVR710307QB4","SAVR710307MNTNZS06","ROSA MARGARITA SANCHEZ VAZQUEZ","TECNICO SUPERIOR",35,83101,1,3,7,"T03823",0,47,7,null,20200101,20200331,61158.04]
["NAYARIT","18FIA0001J",100,"SEMJ6202286DA","SEMJ620228HNTTRS03","J. JESUS STEPHENS MARTINEZ","OFICINA DE SERVICIOS Y MANTENIMIENTO",35,83101,1,9,35,"S01803",0,26,2,null,20200101,20200331,43899.78]
["NAYARIT","18FIA0001J",100,"SIMG650906SD7","SIMG650906MNTLDD05","MARIA GUADALUPE SILLAS MEDINA","TECNICO DOCENTE",35,83101,1,7,17,"T03820",0,168,7,null,20200101,20200331,60748.59]
["NAYARIT","18FIA0001J",100,"TARJ6211276C6","TARJ621127HNTPMN07","JUAN CARLOS TAPIA RAMOS","TECNICO DOCENTE",35,83101,1,7,12,"T03820",0,184,7,null,20200101,20200331,60183.57]
["NAYARIT","18FIA0001J",100,"UISA6804151H1","UISA680415MNTRNN07","ANASTASIA URIBE SANDOVAL","ANALISTA ADMINISTRATIVO",35,83101,1,7,16,"A01806",0,140,3,null,20200101,20200331,57266.23]
["NAYARIT","18FIA0001J",100,"VAFM600616B56","VAFM600616HNTLRN07","MANUEL VALDIVIA FRANCO","TECNICO SUPERIOR",35,83101,1,8,28,"A01807",0,40,7,null,20200101,20200331,55615.82]
["NAYARIT","18FIA0001J",100,"VAIA770111PN8","VAIA770111MNTZRD09","ADRIANA VAZQUEZ IRIARTE","TECNICO SUPERIOR",35,83101,1,4,11,"T03823",0,58,7,null,20200101,20200331,57997.66]
["NAYARIT","18FIA0001J",100,"VAPL6101108S1","VAPL610110MNTLLL06","LILIA ANGELICA VALENCIA PLASCENCIA","ANALISTA ADMINISTRATIVO",35,83101,1,1,1,"A01806",0,4,3,null,20200101,20200331,56528.73]
["NAYARIT","18FIA0001J",100,"VARE720715LZ0","VARE720715MNTRMN06","ENRIQUETA VARGAS ROMERO","TECNICO DOCENTE",35,83101,1,7,14,"T03820",0,130,7,null,20200101,20200331,63823.23]
["NAYARIT","18FIA0001J",100,"VIAB780203S93","VIAB780203HNTLLS09","BASILIO VILLASEÑOR ALCANTAR","TECNICO DOCENTE",35,83101,1,7,15,"T03820",0,170,7,null,20200101,20200331,60630.33]
["NAYARIT","18FIA0001J",100,"VIVB5403237M0","VIVB540323HCMLRL07","BALDOMERO VILLANUEVA VERDUZCO","TECNICO DOCENTE",35,83101,1,7,17,"T03820",0,78,7,null,20200101,20200331,62338.5]
["NAYARIT","18FIA0001J",100,"ZADS640611A57","ZADS640611MDFVRN00","MARIA SANDRA HADAID ZAVALA DUARTE","TECNICO DOCENTE",35,83101,1,7,14,"T03820",0,62,7,null,20200101,20200331,49484]
["NAYARIT","18FIA0001J",100,"ZULL580228GH3","ZULL580228MDFXNR03","MARIA DE LOURDES ZUÑIGA LEON","TECNICO DOCENTE",35,83101,1,7,14,"T03820",0,118,7,null,20200101,20200331,57134.6]
["NAYARIT","18FIA0001J",100,"BABM641012R5A","BABM641012MNTRRR07","MERCEDES BARRAGAN BARRIGA","TECNICO OPERATIVO",35,83101,0,0,0,0,0,0,0,null,20200101,20200331,14344.74]
["NAYARIT","18FIA0001J",100,"LOPE790615FN1","LOPE790615HNTBNG03","EUGENIO LOBATOS PANCHO","TECNICO OPERATIVO",35,83101,0,0,0,0,0,0,0,null,20200101,20200331,14344.74]
["NAYARIT","18FIA0001J",100,"LOCL670621BR2","LOCL670621HNTPSS00","JOSE LUIS LOPEZ CASTAÑEDA","TECNICO OPERATIVO",35,83101,0,0,0,0,0,0,0,null,20200101,20200331,14344.74]
["NAYARIT","18FIA0001J",100,"DIFS890414J89","DIFS890414MNTSRN03","SANDY ELIZABETH DE DIOS FRANCO","TECNICO OPERATIVO",35,83101,0,0,0,0,0,0,0,null,20200101,20200331,14344.74]
["NAYARIT","18FIA0001J",100,"RAMM850120624","RAMM850120HNTMR08","MANUEL ANTONIO RAMOS MARQUEZ","TECNICO OPERATIVO",35,83101,0,0,0,0,0,0,0,null,20200101,20200331,14344.74]
["NAYARIT","18FIA0001J",100,"FOMF8109082P0","FOMF810908HNTLRD09","FIDEL FLORES MARIN","TECNICO OPERATIVO",35,83101,0,0,0,0,0,0,0,null,20200101,20200331,14344.74]
["NAYARIT","18FIA0001J",100,"EABI6702174N9","EABI670217MCCSRR09","ESPAÑA BARRERA IRMA LETICIA","TECNICO OPERATIVO",35,83101,0,0,0,0,0,0,0,null,20200101,20200331,14344.74]
["NAYARIT","18FIA0001J",100,"PEGI6704051N2","PEGI670405HNTRNS08","PEREZ GONZALEZ MARIA ISABEL","TECNICO OPERATIVO",35,83101,0,0,0,0,0,0,0,null,20200101,20200331,14344.74]
["NAYARIT","18FIA0001J",100,"MUAA760211IC0","MUAA760211HNTRCM09","MURILLO ACOSTA AMPELIO","TECNICO OPERATIVO",35,83101,0,0,0,0,0,0,0,null,20200101,20200331,14344.74]
["NAYARIT","18FIA0001J",100,"CAPR660904LW1","CAPR660904MNTRRS05","CARRILLO PARTIDA ROSA MARIA","TECNICO OPERATIVO",35,83101,0,0,0,0,0,0,0,null,20200101,20200229,9563.16]
["NAYARIT","18FIA0001J",100,"MEFJ900623F24","MEFJ900623HNTDNN09","MEDINA FONSECA JUAN CARLOS","TECNICO OPERATIVO",35,83101,0,0,0,0,0,0,0,null,20191001,20200331,14344.74]
["NAYARIT","18FIA0001J",100,"RAAM930425JH3","RAAM930425MNTMVR03","MARISOL ANAHI RAMIREZ AVILA ","TECNICO OPERATIVO",35,83101,0,0,0,0,0,0,0,null,20200101,20200331,14344.74]
["NAYARIT","18FIA0001J",100,"TOVY831104BU5","TOVY831104MNTRZR03","YURIDIA TORRES VAZQUEZ ","TECNICO OPERATIVO",35,83101,0,0,0,0,0,0,0,null,20200301,20200331,4781.58]
["NAYARIT","18FIA0001J",100,"MAOE820709BC1","MAOE820709MNTRRL06","ELVA LORENA MARQUEZ OROZCO ","JEFA DE DEPARTAMENTO",35,83101,1,3,7,"CF01059",0,302,"OA1",null,20200101,20200331,55320.39]
["NAYARIT","18FIA0001J",100,"SAMA9504119YA","SAMA950411HNTLRL05","ALAN EDUARDO MARTINEZ SALINAS ","COORDINADOR DE SERV. ESP.",35,83101,1,9,36,"CF33849",0,354,8,null,20200101,20200229,23048.880000000001]
["NAYARIT","18FIA0001J",100,"OEGH8909064U9","OEGH890906HNTRZC02","HECTOR ALBERTO ORTEGA GUZMAN","ESPECIALISTA EN PROYECTOS",35,83101,1,7,14,"T03810",0,308,2,null,20200101,20200331,40557.040000000001]
["NAYARIT","18FIA0001J",100,"FALN810731E5A","FALN810731MDFRNR05","NORA EDITH FRANCO LUNA ","SECRETARIA C",35,83101,1,8,28,"A03804",0,286,2,null,20200101,20200331,43914.89]
["NAYARIT","18FIA0001J",100,"PAOK860904PU2","PAOK860904MNTRCR08","KAREN LISSETTE PARDO OCHOA","ESPECIALISTA EN PROYECTOS",35,83101,1,7,14,"T03810",0,313,2,null,20200101,20200331,40296.559999999998]
["NAYARIT","18FIA0001J",100,"IAAA790420LG8","IAAA790420HNTBLN02","ANTONIO IBARRA ALMARAZ","OFICINA DE SERVICIOS Y MANTENIMIENTO",35,83101,1,9,35,"S01803",0,314,2,null,20200101,20200331,40596.559999999998]
["NAYARIT","18FIA0001J",100,"MOFG790213LUA","MOFG790213MNTLD00","MARIA GUADALUPE MONTAÑEZ FLETES","SECRETARIA C",35,83101,1,9,36,"A03804",0,319,2,null,20200101,20200331,34908.839999999997]
["NAYARIT","18FIA0001J",100,"COHN840218I76","COHN840218HNTRRS08","NESTOR SIMITRO CORTES HERNANDEZ","TECNICO MEDIO",35,83101,1,2,4,"T03803",0,321,2,null,20200101,20200331,39710.480000000003]
["NAYARIT","18FIA0001J",100,"CAAY720710LWA","CAAY720710MNTRVL00","CARRILLO AVALOS YOLANDA ","COORD. DE SERVICIOS ESP.",35,83101,1,3,8,"CF33849",0,326,8,null,20200101,20200331,49466.64]
["NAYARIT","18FIA0001J",100,"OOCM8808119H1","OOCM880811MNTRRN02","OROZCO CRUZ MONICA CLARISSA","TECNICO MEDIO",35,83101,1,4,11,"T03803",0,325,2,null,20200101,20200331,44322.15]
["NAYARIT","18FIA0001J",100,"GANP690420GX5","GANP690420MNTRXT06","GARCIA NUÑEZ PATRICIA","DIRECTOR GENERAL",35,83101,1,1,1,"CF14070",0,339,"MB2",null,20200101,20200331,200715.21]
["NAYARIT","18FIA0001J",100,"MARG741212515","MARG741212MNTRMD18","MARTINEZ RAMOS MARIA GUADALUPE","JEFE DE DEPARTAMENTO",35,83101,1,3,7,"CF01059",0,341,"OA1",null,20200101,20200331,54840.39]
["NAYARIT","18FIA0001J",100,"AUGW800801IE7","AUGW800801MNTGRN05","AGUILAR GARAY WENDY ARLENNE","TECNICO DOCENTE",35,83101,1,7,12,"T03820",0,335,7,null,20200101,20200331,54158.06]
["NAYARIT","18FIA0001J",100,"DUOM651107SS4","DUOM651107MNTRRR01","DURAN OROZCO MARTHA LORENA","JEFE DE OFICINA",35,83101,1,7,15,"A01807",0,119,5,null,20200101,20200331,47867.519999999997]
["NAYARIT","18FIA0001J",100,"AUZF900612KY1","AUZF900612MNTGPB08","AGUILAR ZEPEDA FABIOLA AZUCENA","ESPECIALISTA EN PROYECTOS",35,83101,1,7,16,"T03810",0,336,2,null,20200101,20200331,42209.85]
["NAYARIT","18FIA0001J",100,"PAMK9402063H8","PAMK940206MNTRRR03","PARTIDA MARMOLEJO KAREN GRECIA ITZEL","ESPECIALISTA EN PROYECTOS",35,83101,1,7,16,"T03810",0,338,2,null,20200101,20200331,39710.480000000003]
["NAYARIT","18FIA0001J",100,"PEFG900607MC1","PEFG900607MNTRLR04","PEREZ FLORES MARIA GRACIELA","TECNICO MEDIO ",35,83101,1,8,29,"T03803",0,337,2,null,20200101,20200331,36465.33]
["NAYARIT","18FIA0001J",100,"GOHS820825LT2","GOHS820825MNTNRL02","GONZALEZ HERNANDEZ SOLEDAD ","SECRETARIA C",35,83101,1,9,35,"A03804",0,368,2,null,20200101,20200331,37477.620000000003]
["NAYARIT","18FIA0001J",100,"MIAC880412U2A","MIAC880412MNTNGR00","MINJARES AGUILAR CARMEN EUGENIA","ESPECIALISTA EN PROYECTOS ",35,83101,1,2,6,"T03810",0,369,2,null,20200101,20200331,36465.33]
["NAYARIT","18FIA0001J",100,"AATJ8211206T9","AATJ821120MNTLR01","ALDACO TORRES JANETH YAHAIRA","TECNICO DOCENTE ",35,83101,1,7,16,"T03820",0,366,7,null,20200101,20200331,47196.61]
["NAYARIT","18FIA0001J",100,"NUOL790816HL2","NUOL790816MNTXRZ00","NUÑEZ ORTEGA LIZETH DEL ROCIO","JEFE DE DEPARTAMENTO",35,83101,1,9,33,"CF01059",0,342,"OA1",null,20200101,20200331,54840.39]
["NAYARIT","18FIA0001J",100,"OOGV931204UX8","OOGV931204HNTCRC09","VICENTE OCHOA GARCIA","COORDINADOR DE SERV. ESP.",35,83101,1,3,8,"CF33849",0,370,8,null,20200101,20200115,16444.439999999999]
["NAYARIT","18FIA0001J",100,"MOOM870801V58","MOOM870801HNTNRR01","MARIANO ENRIQUE MONTERO ORTEGA","COORDINADOR REGIONAL",35,83101,1,1,2,"CF36014",0,364,"OA1",null,20200101,20200331,54840.39]
["NAYARIT","18FIA0001J",100,"MEVA810103318","MEVA810103HNTZLB07","ABEL MEZA DEL VALLE","COORDINADOR DE ZONA ",35,83101,1,7,12,"CF36014",0,367,"OA1",null,20200101,20200331,54840.45]
["NAYARIT","18FIA0001J",100,"AAGD8310245TA","AAGD831024HNTYRN07","DANIEL ENRIQUE AYALA GARCIA","COORDINADOR DE ZONA ",35,83101,1,7,12,"CF36014",0,363,"OA1",null,20200101,20200331,54840.45]
["NAYARIT","18FIA0001J",100,"GOMJ751008TZA","GOMJ751008HNTNRL06","JULIO CESAR GONZALEZ MORENO","CORDINADOR DE  ZONA ",35,83101,1,7,12,"CF36014",0,343,"OA1",null,20200101,20200331,54840.45]
["NAYARIT","18FIA0001J",100,"CEGY820421KN7","CEGY820421MNTJRS03","YESENIA YANETH CEJA GARCIA","COORDINADOR DE ZONA ",35,83101,1,7,12,"CF36014",0,352,"OA1",null,20200101,20191231,54840.45]
["NAYARIT","18FIA0001J",100,"MAOA780907LV5","MAOA780907HNTCRL08","JOSE ALBERTO MACEDO ORTEGA ","JEFE DE DEPARTAMENTO",35,83101,1,8,30,"CF01059",0,353,"OA1",null,20190831,20190831,1046.67]
["NAYARIT","18FIA0001J",100,"GALA860819222","GALA860819MJCRRN05","ANGELICA MARIA GUADALUPE GARCIA LOERA","COORDINADOR DE UNIDAD",35,83101,1,2,5,"CF33849",0,356,8,null,20200101,20200331,49466.64]
["NAYARIT","18FIA0001J",100,"SESN8801138H9","SESN880113MNTPNN09","SEPULVEDA SANDOVAL NANCY THALIA","SECRETARIA EJECUTIVA B",35,83101,1,9,34,"C26162",0,372,6,null,20200101,20200331,44376.38]
["NAYARIT","18FIA0001J",100,"CAGS9102045J1","CAGS910204MNTRNT07","CARRILLO GONZALEZ STEPHANIE","SECRETARIA C ",35,83101,1,8,28,"B24322",0,375,2,null,20200101,20200331,35509.71]
["NAYARIT","18FIA0001J",100,"GUBJ8403153GA","GUBJ840315MNTTRS06                                                                                                                                                                                                                                           ","GUTIERREZ BERNAL JOSELIN DEL CARMEN","COORDINADOR DE ZONA ",35,83101,1,7,12,"C292OA2",0,373,"OA1",null,20200101,20200331,54797.53]
["NAYARIT","18FIA0001J",100,"SAPC9205035G0","SAPC920503MNTNLN03","SANTANA POLANCO CINTHIA DANIELA","TECNICO DOCENTE ",35,83101,1,7,14,"B28272",0,379,7,null,20200101,20200331,42875.38]
["NAYARIT","18FIA0001J",100,"ROCO870109C61","ROCO870109HNTBRS08","ROBLES CORDERO OSCAR HUMBERTO","SECRETARIA C ",35,83101,1,8,29,"B24322",0,378,2,null,20200101,20200331,35509.71]
["NAYARIT","18FIA0001J",100,"CAFJ920621U84","CAFJ920621MNTRLL08","CARRILLO FLORES JULIA DEL CARMEN","SECRETARIA C ",35,83101,1,8,29,"B24322",0,374,2,null,20200101,20200331,35509.71]
["NAYARIT","18FIA0001J",100,"BUBA831109E36","BUBA831109MNTSRN01","BUSTAMANTE BORRAYO ANA RUTH","ANALISTA ADMINISTRATIVO",35,83101,1,8,27,"C27032",0,371,3,null,20200101,20200331,40536.379999999997]
["NAYARIT","18FIA0001J",100,"JIRK960721P84","JIRK960721MBCMZT05","JIMENEZ RUIZ KATIA FERNANDA","ESPECIALISTA EN PROYECTOS TECNICOS",35,83101,1,9,34,"B25922",0,376,2,null,20200101,20200331,35509.71]
["NAYARIT","18FIA0001J",100,"UIIL750709IJ9","UIIL750709MNTRBV05","URIBE IBARRA LIVIER","COORDINADOR DE ZONA ",35,83101,1,7,12,"C392OA2",0,380,"OA1",null,20200101,20200331,54407.39]
["NAYARIT","18FIA0001J",100,"QUNL8911244Q6","QUNL891124MNTRXS06","QUIROGA NUÑEZ LESLIE GABRIELA","ESPECIALISTA EN PROYECTOS TECNICOS",35,83101,1,9,34,"B25922",0,377,2,null,20200101,20200331,37173.18]
["NAYARIT","18FIA0001J",100,"MAML0011014V6","MAML001101HNTYDZA3","MAYORQUIN MEDINA LAZARO JOSEHANGEL","ESPECIALISTA EN PROYECTOS TECNICOS",35,83101,1,7,12,"T03810",0,387,2,null,20200101,20200331,35287.410000000003]
["NAYARIT","18FIA0001J",100,"BAMJ921231AL0","BAMJ921231HNTRRS04","BARRIOS MORA JESUS ARMANDO","ESPECIALISTA EN PROYECTOS TECNICOS",35,83101,1,7,13,"T03810",0,384,2,null,20200101,20200331,33134.19]
["NAYARIT","18FIA0001J",100,"LOZY811228DK1","LOZY811228MNTPVD01","LOPEZ ZAVALA YADIRA ALEJANDRA","SECRETARIA C ",35,83101,1,7,13,"A03804",0,385,2,null,20200101,20200331,33134.19]
["NAYARIT","18FIA0001J",100,"AAUB980612QV5","AAUB980612MNTVRR02","AVALOS URIBE BRISA ALEJANDRA","TECNICO DOCENTE ",35,83101,1,7,16,"T03820",0,383,7,null,20200101,20200331,39561.64]
["NAYARIT","18FIA0001J",100,"MAAK930122C18","MAAK930122MNTRLR05","MARTINEZ ALMEJO KAREN ABIGAIL","ESPECIALISTA EN PROYECTOS TECNICOS",35,83101,1,9,34,"T03810",0,386,2,null,20200101,20200331,33134.19]
["NAYARIT","18FIA0001J",100,"RATV791021AJ6","RATV791021HNTMPC03","RAMIREZ TOPETE  VICTOR JAVIER","JEFE DE DEPARTMENTO",35,83101,1,9,34,"CF01059",0,382,"0A1",null,20200101,20200331,54143.57]
["NAYARIT","18FIA0001J",100,"DEPE9006239M6","DEPE900623HNTLXN06","DELGADO PEÑA ENRIQUE","COORDINADOR DE SERV. ESP.",35,83101,1,3,8,"CF33849",0,388,8,null,20200116,20200331,33022.199999999997,{"$f":"SUM(U16:U165)","v":0}]
["NAYARIT","18FIA0001J",100,"FAMM9508109Q2","FAMM950810MNTRNY05","FRANCO MONROY MIRIAM ANGELICA ","COORDINADOR DE SERV. ESP.",35,83101,1,9,36,"CF33849",0,389,8,null,20200201,20200331,26417.759999999998]
["NAYARIT","18FIA0001J",100,"HIEL8602266Y1","HIEL860226HNTDSS08","HIDALGO ESCOBAR LUIS ALBERTO","ANALISTA ADMINISTRATIVO",35,83101,1,7,15,"A01806",0,288,3,null,20200101,20200115,5617.51]
[null,null,null,null,null,null,null,null,null,null,null,null,null,null,null,null,null,null,null,{"$f":"SUM(T16:T174)","v":7672029.0800000038}]
[null,null,null,null,null,null,null,null,null,null,null,null,null,null,null,null,null,"Total Ppto. Otras Fuentes:"]
["*Total de Percepciones reportadas por la Entidad Federativa como pagadas al trabajador durante la comisión.",null,null,null,null,null,null,null,null,null,null,null,null,null,null,null,null,null,null,null," "]
["Fuente : Información proporcionada por las Entidades Federativas"]

{"sheet":"II D) 2","index":6,"n_rows":24,"n_cols":19,"rows_kept":24,"cut":false,"hidden":false,"merged":[[8,1,8,9],[11,1,12,1],[11,5,12,5],[11,2,12,2],[11,3,12,3],[11,4,12,4],[11,16,12,16],[11,15,12,15],[11,17,12,17],[11,18,12,18],[11,6,11,12],[11,13,12,13],[11,14,12,14]]}
[]
[]
[]
[]
[]
[]
[]
[null,"Formato: Movimientos de Plazas"]
[null,{"$f":"IF('Caratula Resumen'!D22=\"Elige el Periodo…\",\"\",'Caratula Resumen'!D22)","v":"Fondo de Aportaciones para la Educación Tecnológica y de Adultos/Instituto Nacional para la Educación de los Adultos (FAETA/INEA)"},null,null,null,null,null,null,null,null,null,null,null,null,null,null,null,{"$f":"IF('Caratula Resumen'!D23=\"Elige el Periodo…\",\"\",'Caratula Resumen'!D23)","v":"1er. Trimestre"}]
[]
[]
[null,"Entidad Federativa","RFC","CURP","Nombre","Origen Presupuestal\n de la plazas","Clave Presupuestal",null,null,null,null,null,null,"Clave de nivel de puesto","Clave de nivel de sueldo","Zona Económica","Tipo de movimiento","Quincena Inicial","Quincena Final"]
[null,null,null,null,null,null,"Partida Presupuestal","Código de Pago","Clave de Unidad","Clave de Sub Unidad","Clave de Categoría","Horas Semana Mes ","Número de Plaza"]
[]
[null,"Entidad Federativa","RFC","CURP","Nombbre","Origen Presupuestal\n de la plazas","Partida Presupuestal","Código de Pago","Clave de Unidad","Clave de Sub Unidad","Clave de Categoría","Horas semana mes","Número de plaza","Clave de nivel de puesto","Clave de nivel de sueldo","Zona Económica","Tipo de movimiento","Quincena Inicial","Quincena Final"]
[null,"NAYARIT","DEPE9006239M6","DEPE900623HNTLXN06","DELGADO PEÑA ENRIQUE",null,null,1,3,8,"CF33849",0,388,8,"OA1","B","1","202002"]
[null,"NAYARIT","FAMM9508109Q2","FAMM950810MNTRNY05","FRANCO MONROY MIRIAM ANGELICA ",null,null,1,9,36,"CF33849",0,389,8,"OA1","B","1","202003"]
[null,"NAYARIT","SAMA9504119YA","SAMA950411HNTLRL05","ALAN EDUARDO MARTINEZ SALINAS ",null,null,1,9,36,"CF33849",0,354,8,"OA2","B","2","201801","202002"]
[null,"NAYARIT","OOGV931204UX8","OOGV931204HNTCRC09","VICENTE OCHOA GARCIA",null,null,1,3,8,"CF33849",0,370,8,"OA3","B","2","201812","202001"]
[null,null,null,null,"HIDALGO ESCOBAR LUIS ALBERTO",null,null,1,7,15,"A01806",0,288,3,"3","C","2","201215","202001"]
[]
[]
[]
[null,"Fuente : Información proporcionada por las Entidades Federativas"]

{"sheet":"II D) 4","index":7,"n_rows":28,"n_cols":17,"rows_kept":28,"cut":false,"hidden":false,"merged":[[24,13,24,14],[12,0,13,0],[12,6,13,6],[12,7,12,13],[12,14,12,15],[12,2,13,2],[12,1,13,1],[12,16,13,16],[12,5,13,5],[12,4,13,4],[12,3,13,3],[9,1,9,9]]}
[]
[]
[]
[]
[]
[]
[]
[]
[null,"Formato: Trabajadores Jubilados en el Periodo"]
[null,{"$f":"IF('Caratula Resumen'!D22=\"Elige el Periodo…\",\"\",'Caratula Resumen'!D22)","v":"Fondo de Aportaciones para la Educación Tecnológica y de Adultos/Instituto Nacional para la Educación de los Adultos (FAETA/INEA)"},null,null,null,null,null,null,null,null,null,null,null,null,null,{"$f":"IF('Caratula Resumen'!D23=\"Elige el Periodo…\",\"\",'Caratula Resumen'!D23)","v":"1er. Trimestre"}]
[]
[]
[null,"Entidad Federativa","R.F.C.","CURP","NOMBRE","Clave CT","Última(s) ó Penultima(s) Plaza(s) Ocupada(s)\n(*)","Clave Presupuestal de la Jubilación",null,null,null,null,null,null,"Periodo ocupado",null,"Quincena de inicio de jubilación"]
[null,null,null,null,null,null,null,"Partida Presupuestal","Código de Pago","Clave de Unidad","Clave de Sub Unidad","Clave de Categoría","Horas Semana Mes ","Número de Plaza","Inicio","Conclusión"]
[]
[null,"Entidad Federativa","R.F.C.","CURP","NOMBRE","Clave Centro de Trabajo","Última(s) ó Penultima(s) Plaza(s) Ocupada(s)\n(*)","Partida Presupuestal","Código de Pago","Clave de Unidad","Clave de Sub Unidad","Clave de Categoría","Horas Semana Mes ","Número de Plaza","Periodo ocupado\nInicio","Periodo ocupado\nConclusión","Quincena de inicio de jubilación"]
[]
[]
[]
[]
[]
[]
[null,"Total Personas : ",2,null,null,null,null,null,null,null,null,"Total Plazas : ",null,2]
[]
[]
[]
[null,"Fuente : Información proporcionada por las Entidades Federativas"]
[null,"(*) Si  el trabajador se jubila con más de una clave presupuestal, por cada plaza se debe llenar un registro hasta que se haya informado acerca de todas las plazas del trabajador."]

{"sheet":"II D) 4 A","index":8,"n_rows":25,"n_cols":18,"rows_kept":25,"cut":false,"hidden":false,"merged":[[19,13,19,14],[9,1,9,7],[21,13,21,14],[12,17,13,17],[12,1,13,1],[12,2,13,2],[12,3,13,3],[12,4,13,4],[12,5,13,5],[12,6,12,12],[12,13,12,14],[12,15,13,15],[12,16,13,16]]}
[]
[]
[]
[]
[]
[]
[]
[]
[null,"Formato: Trabajadores que Tramitaron Licencia Prejubilatoria en el Periodo"]
[null,{"$f":"IF('Caratula Resumen'!D22=\"Elige el Periodo…\",\"\",'Caratula Resumen'!D22)","v":"Fondo de Aportaciones para la Educación Tecnológica y de Adultos/Instituto Nacional para la Educación de los Adultos (FAETA/INEA)"},null,null,null,null,null,null,null,null,null,null,null,null,null,null,null,{"$f":"IF('Caratula Resumen'!D23=\"Elige el Periodo…\",\"\",'Caratula Resumen'!D23)","v":"1er. Trimestre"}]
[]
[]
[null,"Entidad Federativa","R.F.C.","CURP","NOMBRE","Clave integrada","Clave Presupuestal",null,null,null,null,null,null,"Periodo Licencia",null,"Percepciones pagadas con Presupuesto Federal en el  Periodo reportado*","Percepciones pagadas con Presupuesto de otra Fuente en el  Periodo reportado*","Clave CT Origen"]
[null,null,null,null,null,null,"Partida Presupuestal","Código de Pago","Clave de Unidad","Clave de Sub Unidad","Clave de Categoría","Horas Semana Mes ","Número de Plaza","Inicio","Conclusión"]
[]
[null,"Entidad Federativa","R.F.C.","CURP","NOMBRE","Clave integrada","Partida Presupuestal","Código de Pago","Clave de Unidad","Clave de Sub Unidad","Clave de Categoría","Horas Semana Mes ","Número de Plaza","Periodo Licencia\nInicio","Periodo Licencia\nConclusión","Percepciones pagadas con Presupuesto Federal en el  Periodo reportado*","Percepciones pagadas con Presupuesto de otra Fuente en el  Periodo reportado*","Clave CT Origen"]
[null,"NAYARIT","PORJ590620KP8","PORJ590620MNTLSS06","JOSEFINA POLANCO DE LA ROSA","8310101714T0382000.0397",83101,1,7,14,"T03820",0,39,20200101,20200331,65754.75]
[null,"NAYARIT","ROMR4701016U7","ROMR470101MJCSRS07","MARIA DEL ROSARIO MARTINEZ ROSALES","8310101714T0382000.01167",83101,1,7,14,"T03820",0,116,20200101,20200331,60007.71]
[null,"NAYARIT","GUOJ58032768A","GUOJ580327HNTTCM09","JAIME GUTIERREZ OCAMPO","8310101714T0382000.01097",83101,1,7,14,"T03820",0,109,20200116,20200416,60927.51]
[null,null,"Total Personas : ",3,null,null,null,null,null,null,"Total Plazas : ",null,3,"Total Pto. Federal",null,{"$f":"SUM(P17:P19)","v":186689.97}]
[]
[null,null,null,null,null,null,null,null,null,null,null,null,null,"Total Ppto. Otras Fuentes"]
[]
[null,"*Total de Percepciones reportadas por la Entidad Federativa como pagadas en el periodo "]
[null,"Fuente : Información proporcionada por las Entidades Federativas"]

{"sheet":"II D) 6","index":9,"n_rows":36,"n_cols":13,"rows_kept":36,"cut":false,"hidden":false,"merged":[[10,1,10,6],[13,12,14,12],[13,9,13,10],[13,11,14,11],[13,1,14,1],[13,2,14,2],[13,3,14,3],[13,4,14,4],[13,5,14,5],[13,6,14,6],[13,7,13,8]]}
[]
[]
[]
[]
[]
[]
[]
[]
[]
[null,"Formato: Trabajadores Contratados por Honorarios en el Periodo"]
[null,{"$f":"IF('Caratula Resumen'!D22=\"Elige el Periodo…\",\"\",'Caratula Resumen'!D22)","v":"Fondo de Aportaciones para la Educación Tecnológica y de Adultos/Instituto Nacional para la Educación de los Adultos (FAETA/INEA)"},null,null,null,null,null,null,null,null,null,null,{"$f":"IF('Caratula Resumen'!D23=\"Elige el Periodo…\",\"\",'Caratula Resumen'!D23)","v":"1er. Trimestre"}]
[]
[]
[null,"Entidad Federativa","Clave Centro de Trabajo","R.F.C.","CURP","Nombre","Identificador del Contrato","Equivalencia",null,"Periodo de Contratación",null,"Función","Percepciones pagadas dentro del periodo reportado"]
[null,null,null,null,null,null,null,"Clave de Categoría","Horas Semana Mes ","Inicio","Conclusión"]
[]
[null,"Entidad Federativa","Clave Centro de Trabajo","R.F.C.","CURP","Nombre","Identificador del Contrato","Clave de Categoría","Horas Semana Mes ","Periodo de Contratación\nInicio","Periodo de Contratación\nConclusión","Función","Percepciones pagadas dentro del periodo reportado"]
[null,"NAYARIT","18FIA0001J","BABM641012R56","BABM641012MNTRRR07","MERCEDES BARRAGAN BARRIGA","BABM641012R5A",0,"00.0",20200101,20200331,"asistencia educativa",14344.74]
[null,"NAYARIT","18FIA0001J","LOCL670621AF9","LOCL670621HNTPSS00","JOSE LUIS LOPEZ CASTAÑEDA","LOCL670621BR2",0,"00.0",20200101,20200331,"asistencia educativa",14344.74]
[null,"NAYARIT","18FIA0001J","DIFS890414J89","DIFS890414MNTSRN03","SANDY ELIZABETH DE DIOS FRANCO","DIFS890414J89",0,"00.0",20200101,20200331,"asistencia educativa",14344.74]
[null,"NAYARIT","18FIA0001J","FOMF8109082P0","FOMF810908HNTLRD09","FIDEL MARIN FLORES","FOMF8109082P0",0,"00.0",20200101,20200331,"asistencia educativa",14344.74]
[null,"NAYARIT","18FIA0001J","EABI6702173C1","EABI670217MCCSRR09","IRMA LETICIA ESPAÑA BARRERA","EABI6702174N9",0,"00.0",20200101,20200331,"asistencia educativa",14344.74]
[null,"NAYARIT","18FIA0001J","PEGI6704051N2","PEGI670405HNTRNS08","MARIA ISABEL PEREZ GONZALEZ ","PEGI6704051N2",0,"00.0",20200101,20200331,"asistencia educativa",14344.74]
[null,"NAYARIT","18FIA0001J","RAAM930425JH3","RAAM930425MNTMVR03","MARISOL ANAHI RAMIREZ AVILA ","RAAM930425JH3",0,"00.0",20200101,20200331,"asistencia educativa",14344.74]
[null,"NAYARIT","18FIA0001J","MUAA760211IC0","MUAA760211HNTRCM09","AMPELIO MURILLO ACOSTA","MUAA760211IC0",0,"00.0",20200101,20200331,"asistencia educativa",14344.74]
[null,"NAYARIT","18FIA0001J","LOPE790615FN1","LOPE790615HNTBNG03","EUGENIO LOBATOS PANCHO ","LOPE790615FN1",0,"00.0",20200101,20200331,"asistencia educativa",14344.74]
[null,"NAYARIT","18FIA0001J","CAPR660904LW1","CAPR660904MNTRRS05","ROSA MARIA CARILLO PARTIDA ","CAPR660904LW1",0,"00.0",20200101,20200229,"asistencia educativa",9563.16]
[null,"NAYARIT","18FIA0001J","MEFJ900623F24","MEFJ900623HNTDNN09","MEDINA FONSECA JUAN CARLOS ","MEFJ900623F24",0,"00.0",20200101,20200331,"asistencia educativa",14344.74]
[null,"NAYARIT","18FIA0001J","RAMM850120624","RAMM850120HNTMRN08","RAMOS MARQUEZ MANUEL ANTONIO","RAMM850120624","0","00.0","20200101","20200331","asistencia educativa","14,344.74"]
[null,null,null,null,null,"YURIDIA TORRES VAZQUEZ ","TOVY831104BU5",0,"00.0",20200301,20200331,"asistencia educativa",4781.58]
[null,"Total Entidad Federativa Personas : ",null,12,null,null,null,null,null,null,null,"Subtotal Monto Pagado en el Periodo:",{"$f":"SUM(M18:M30)","v":157792.13999999998}]
[]
[]
[null,null,null,null,null,null,null,null,null,"Total   Percepciones :"]
[]
[null,"Fuente : Información proporcionada por las Entidades Federativas"]

{"sheet":"II D) 7 1","index":10,"n_rows":44,"n_cols":19,"rows_kept":44,"cut":false,"hidden":false,"merged":[[40,16,40,17],[12,18,13,18],[12,13,13,13],[12,14,13,14],[12,15,13,15],[12,16,13,16],[8,17,8,18],[9,1,9,9],[12,6,13,6],[12,7,12,9],[12,10,13,10],[12,11,13,11],[12,12,13,12],[12,1,13,1],[12,2,13,2],[12,3,13,3],[12,4,13,4],[12,5,13,5],[12,17,13,17]]}
[]
[]
[]
[]
[]
[]
[]
[]
[null,"Formato: Analítico de Categorías / Plazas Autorizadas con su Tabulador",null,null,null,null,null,null,null,null,null,null,null,null,null,null,"Entidad Federativa:",{"$f":"IF('Caratula Resumen'!D21=\"Elige el Periodo…\",\"\",'Caratula Resumen'!D21)","v":" NAYARIT "}]
[null,{"$f":"IF('Caratula Resumen'!D22=\"Elige el Periodo…\",\"\",'Caratula Resumen'!D22)","v":"Fondo de Aportaciones para la Educación Tecnológica y de Adultos/Instituto Nacional para la Educación de los Adultos (FAETA/INEA)"},null,null,null,null,null,null,null,null,null,null,null,null,null,null,null,null,{"$f":"IF('Caratula Resumen'!D23=\"Elige el Periodo…\",\"\",'Caratula Resumen'!D23)","v":"1er. Trimestre"}]
[]
[]
[null,"Clave Tipo educativo","Clave Nivel educativo","Clave Subnivel educativo","Descripción Nivel / Subnivel","Tipo Financiamiento","Partida Presupuestal","CATEGORIA",null,null,"Zona Económica","Nivel Puesto","Nivel Sueldo","Tipo Contratación","Monto mensual\npor plaza jornada","Monto mensual\nPor Plaza HSM","Número de Plazas Jornada","Número de Plazas HSM","Monto total autorizado"]
[null,null,null,null,null,null,null,"Tipo de Categoría"," Categoría","Descripción"]
[]
[null,"Clave Tipo educativo","Clave Nivel educativo","Clave Subnivel educativo","Descripción Nivel / Subnivel","Tipo Financiamiento","Partida Presupestal","Tipo de Categoría"," Categoría","Descripción","Zona Económica","Nivel Puesto","Nivel Sueldo","Tipo Contratación","Monto mensual\npor plaza jornada","Monto mensual\nPor Plaza HSM","Número de Plazas Jornada","Número de Plazas HSM","Monto total autorizado"]
[null,6,61,64,"PRIMARIA, SECUNDARIA Y CAPACITACION PARA EL TRABAJO","FEDERAL",83101,2,"A01803","ADMINISTRATIVO ESPECIALIZADO ","B",29,2,"P",6093.65,0,1,0,{"$f":"Tabla15[[#This Row],[Monto mensual\npor plaza jornada]]*Tabla15[[#This Row],[Número de Plazas Jornada]]","v":6093.65}]
[null,6,61,64,"PRIMARIA, SECUNDARIA Y CAPACITACION PARA EL TRABAJO","FEDERAL",83101,2,"S01803","OFICIAL DE SERVICIOS Y MANTENIMIENTO","B",21,2,"P",6093.65,0,3,0,{"$f":"Tabla15[[#This Row],[Monto mensual\npor plaza jornada]]*Tabla15[[#This Row],[Número de Plazas Jornada]]","v":18280.949999999997}]
[null,6,61,64,"PRIMARIA, SECUNDARIA Y CAPACITACION PARA EL TRABAJO","FEDERAL",83101,2,"A01805","AUXILIAR DE ADMINISTRADOR","B",46,2,"P",6093.65,0,1,0,{"$f":"Tabla15[[#This Row],[Monto mensual\npor plaza jornada]]*Tabla15[[#This Row],[Número de Plazas Jornada]]","v":6093.65}]
[null,6,61,64,"PRIMARIA, SECUNDARIA Y CAPACITACION PARA EL TRABAJO","FEDERAL",83101,2,"T03803","TECNICO MEDIO ","B",47,2,"P",6093.65,0,7,0,{"$f":"Tabla15[[#This Row],[Monto mensual\npor plaza jornada]]*Tabla15[[#This Row],[Número de Plazas Jornada]]","v":42655.549999999996}]
[null,6,61,64,"PRIMARIA, SECUNDARIA Y CAPACITACION PARA EL TRABAJO","FEDERAL",83101,2,"A03804","SECRETARIA \"C\" ","B",43,2,"P",6093.65,0,11,0,{"$f":"Tabla15[[#This Row],[Monto mensual\npor plaza jornada]]*Tabla15[[#This Row],[Número de Plazas Jornada]]","v":67030.149999999994}]
[null,6,61,64,"PRIMARIA, SECUNDARIA Y CAPACITACION PARA EL TRABAJO","FEDERAL",83101,2,"T03810","ESPECIALISTA EN PROYECTOS TECNICOS ","B",59,2,"P",6093.65,0,9,0,{"$f":"Tabla15[[#This Row],[Monto mensual\npor plaza jornada]]*Tabla15[[#This Row],[Número de Plazas Jornada]]","v":54842.85}]
[null,6,61,64,"PRIMARIA, SECUNDARIA Y CAPACITACION PARA EL TRABAJO","FEDERAL",83101,3,"A01806","ANALISTA ADMINISTRATIVO ","B",70,3,"P",6256.25,0,5,0,{"$f":"Tabla15[[#This Row],[Monto mensual\npor plaza jornada]]*Tabla15[[#This Row],[Número de Plazas Jornada]]","v":31281.25}]
[null,6,61,64,"PRIMARIA, SECUNDARIA Y CAPACITACION PARA EL TRABAJO","FEDERAL",83101,5,"A01807","JEFE DE OFICINA ","B",81,5,"P",6597.4,0,12,0,{"$f":"Tabla15[[#This Row],[Monto mensual\npor plaza jornada]]*Tabla15[[#This Row],[Número de Plazas Jornada]]","v":79168.799999999988}]
[null,6,61,64,"PRIMARIA, SECUNDARIA Y CAPACITACION PARA EL TRABAJO","FEDERAL",83101,7,"T03820","TECNICO DOCENTE ","B",82,7,"P",6824.9,0,29,0,{"$f":"Tabla15[[#This Row],[Monto mensual\npor plaza jornada]]*Tabla15[[#This Row],[Número de Plazas Jornada]]","v":197922.09999999998}]
[null,6,61,64,"PRIMARIA, SECUNDARIA Y CAPACITACION PARA EL TRABAJO","FEDERAL",83101,7,"T03823","TECNICO SUPERIOR ","B",85,7,"P",6824.9,0,9,0,{"$f":"Tabla15[[#This Row],[Monto mensual\npor plaza jornada]]*Tabla15[[#This Row],[Número de Plazas Jornada]]","v":61424.1}]
[null,6,61,64,"PRIMARIA, SECUNDARIA Y CAPACITACION PARA EL TRABAJO","FEDERAL",83101,2,"A01803","ADMINISTRATIVO ESPECIALIZADO ","C",29,2,"P",6743.65,0,1,0,{"$f":"Tabla15[[#This Row],[Monto mensual\npor plaza jornada]]*Tabla15[[#This Row],[Número de Plazas Jornada]]","v":6743.65}]
[null,6,61,64,"PRIMARIA, SECUNDARIA Y CAPACITACION PARA EL TRABAJO","FEDERAL",83101,2,"T03810","ESPECIALISTA EN PROYECTOS TECNICOS ","C",59,2,"P",6743.65,0,2,0,{"$f":"Tabla15[[#This Row],[Monto mensual\npor plaza jornada]]*Tabla15[[#This Row],[Número de Plazas Jornada]]","v":13487.3}]
[null,6,61,64,"PRIMARIA, SECUNDARIA Y CAPACITACION PARA EL TRABAJO","FEDERAL",83101,3,"A01806","ANALISTA ADMINISTRATIVO ","C",70,3,"P",6906,0,4,0,{"$f":"Tabla15[[#This Row],[Monto mensual\npor plaza jornada]]*Tabla15[[#This Row],[Número de Plazas Jornada]]","v":27624}]
[null,6,61,64,"PRIMARIA, SECUNDARIA Y CAPACITACION PARA EL TRABAJO","FEDERAL",83101,5,"A01807","JEFE DE OFICINA ","C",81,5,"P",7239.25,0,1,0,{"$f":"Tabla15[[#This Row],[Monto mensual\npor plaza jornada]]*Tabla15[[#This Row],[Número de Plazas Jornada]]","v":7239.25}]
[null,6,61,64,"PRIMARIA, SECUNDARIA Y CAPACITACION PARA EL TRABAJO","FEDERAL",83101,7,"T03820","TECNICO DOCENTE ","C",82,7,"P",7377.35,0,31,0,{"$f":"Tabla15[[#This Row],[Monto mensual\npor plaza jornada]]*Tabla15[[#This Row],[Número de Plazas Jornada]]","v":228697.85}]
[null,6,61,64,"PRIMARIA, SECUNDARIA Y CAPACITACION PARA EL TRABAJO","FEDERAL",83101,7,"T03823","TECNICO SUPERIOR ","C",85,7,"P",7377.35,0,1,0,{"$f":"Tabla15[[#This Row],[Monto mensual\npor plaza jornada]]*Tabla15[[#This Row],[Número de Plazas Jornada]]","v":7377.35}]
[null,6,61,64,"PRIMARIA, SECUNDARIA Y CAPACITACION PARA EL TRABAJO","FEDERAL",83101,3,"CF34810","ANALISTA ADMINISTRATIVO ","B",70,3,"P",6069.3,0,1,0,{"$f":"Tabla15[[#This Row],[Monto mensual\npor plaza jornada]]*Tabla15[[#This Row],[Número de Plazas Jornada]]","v":6069.3}]
[null,6,61,64,"PRIMARIA, SECUNDARIA Y CAPACITACION PARA EL TRABAJO","FEDERAL",83101,6,"CF04807","SECRETARIA EJECUTIVA \"B\"","B",61,6,"P",6510.6,0,1,0,{"$f":"Tabla15[[#This Row],[Monto mensual\npor plaza jornada]]*Tabla15[[#This Row],[Número de Plazas Jornada]]","v":6510.6}]
[null,6,61,64,"PRIMARIA, SECUNDARIA Y CAPACITACION PARA EL TRABAJO","FEDERAL",83101,8,"CF33849","COORDINADOR DE UNIDAD DE SERVS. ESPECIALIZADOS","B",88,8,"P",6699.65,0,7,0,{"$f":"Tabla15[[#This Row],[Monto mensual\npor plaza jornada]]*Tabla15[[#This Row],[Número de Plazas Jornada]]","v":46897.549999999996}]
[null,6,61,64,"PRIMARIA, SECUNDARIA Y CAPACITACION PARA EL TRABAJO","FEDERAL",83101,"MB2","CF14070","DIRECTOR DE INEA/DELEGADO ","A",97,"MB2","P",14611.06,0,1,0,{"$f":"Tabla15[[#This Row],[Monto mensual\npor plaza jornada]]*Tabla15[[#This Row],[Número de Plazas Jornada]]","v":14611.06}]
[null,6,61,64,"PRIMARIA, SECUNDARIA Y CAPACITACION PARA EL TRABAJO","FEDERAL",83101,"OA1","CF36014","COORDINADOR REGIONAL ZONA I","A",95,"OA1","P",5164.5,0,1,0,{"$f":"Tabla15[[#This Row],[Monto mensual\npor plaza jornada]]*Tabla15[[#This Row],[Número de Plazas Jornada]]","v":5164.5}]
[null,6,61,64,"PRIMARIA, SECUNDARIA Y CAPACITACION PARA EL TRABAJO","FEDERAL",83101,"OA1","CF01059","JEFE DE DEPARTAMENTO ZONA II","B",93,"OA1","P",4685.7,0,5,0,{"$f":"Tabla15[[#This Row],[Monto mensual\npor plaza jornada]]*Tabla15[[#This Row],[Número de Plazas Jornada]]","v":23428.5}]
[null,6,61,64,"PRIMARIA, SECUNDARIA Y CAPACITACION PARA EL TRABAJO","FEDERAL",83101,"OA1","CF36014","COORDINADOR DE ZONA ZONA II","B",92,"OA1","P",4328.8500000000004,0,4,0,{"$f":"Tabla15[[#This Row],[Monto mensual\npor plaza jornada]]*Tabla15[[#This Row],[Número de Plazas Jornada]]","v":17315.400000000001}]
[null,6,61,64,"PRIMARIA, SECUNDARIA Y CAPACITACION PARA EL TRABAJO","FEDERAL",83101,"OA1","CF36014","COORDINADOR DE ZONA ZONA III","C",92,"OA1","P",4649.3500000000004,0,2,0,{"$f":"Tabla15[[#This Row],[Monto mensual\npor plaza jornada]]*Tabla15[[#This Row],[Número de Plazas Jornada]]","v":9298.7000000000007}]
[null,null,null,null,null,null,null,null,null,null,null,null,null,"Total Jornada:",null,null,"Total Autorizado:",null,{"$f":"SUM(S17:S40)","v":985258.06}]
[null,null,null,null,null,null,null,null,null,null,null,null,null,"Total HSM"]
[]
[null,"Fuente : Información proporcionada por las Entidades Federativas"]

{"sheet":"II D) 7 2 ","index":11,"n_rows":758,"n_cols":18,"rows_kept":758,"cut":false,"hidden":false,"merged":[[14,8,15,8],[14,9,14,13],[14,14,14,16],[10,16,10,17],[11,1,11,9],[14,1,15,1],[14,2,15,2],[14,3,15,3],[14,17,15,17],[14,6,15,6],[14,7,15,7],[14,4,15,4],[14,5,15,5]]}
[]
[]
[]
[]
[]
[]
[]
[]
[]
[]
[null,"Formato: Catálogo de Categorías y Tabuladores",null,null,null,null,null,null,null,null,null,null,null,null,null,"Entidad Federativa:",{"$f":"IF('Caratula Resumen'!D21=\"Elige el Periodo…\",\"\",'Caratula Resumen'!D21)","v":" NAYARIT "}]
[null,{"$f":"IF('Caratula Resumen'!D22=\"Elige el Periodo…\",\"\",'Caratula Resumen'!D22)","v":"Fondo de Aportaciones para la Educación Tecnológica y de Adultos/Instituto Nacional para la Educación de los Adultos (FAETA/INEA)"},null,null,null,null,null,null,null,null,null,null,null,null,null,null,null,{"$f":"IF('Caratula Resumen'!D23=\"Elige el Periodo…\",\"\",'Caratula Resumen'!D23)","v":"1er. Trimestre"}]
[]
[]
[null,"Identificador origen presupuestal de la plaza","Clave de categoría","Descripción de la categoría","Tipo de contratación","Tipo de categoría","Clave de concepto de pago","Clave de nivel de puesto","Clave de nivel de sueldo","Sueldo asignado por zona económica",null,null,null,null,"Datos adicionales de horas",null,null,"Fecha de actualización"]
[null,null,null,null,null,null,null,null,null,"Inicio de vigencia del sueldo","Fin de vigencia del sueldo","Monto Mensual Jornada ó de HSM\nZona A","Monto Mensual Jornada ó de HSM\nZona B","Monto Mensual Jornada ó de HSM\nZona C","Horas \nde compatibilidad","Horas de servicio (HSM)","Horas de docencia"]
[]
[null,"Identificador origen presupuestal de la plaza","Clave de categoría","Descripción de la categoría","Tipo de contratación","Tipo de categoría","Clave de concepto de pago","Clave de nivel de puesto","Clave de nivel de sueldo","Inicio de vigencia del sueldo","Fin de vigencia del sueldo","Monto Mensual Jornada ó de HSM\nZona A","Monto Mensual Jornada ó de HSM\nZona B","Monto Mensual Jornada ó de HSM\nZona C","Horas \nde compatibilidad","Horas de servicio (HSM)","Horas de docencia","Fecha de actualización"]
[null,"1","A01803","ADMINISTRATIVO ESPECIALIZADO","P",2,1,29,2,20190101,999999,0,6093.65,0,35,35,0,20191231]
[null,"1","A01803","ADMINISTRATIVO ESPECIALIZADO","P",2,9,29,2,20190101,999999,0,565,0,35,35,0,20191231]
[null,"1","A01803","ADMINISTRATIVO ESPECIALIZADO","P",2,9,29,2,20190101,999999,0,565,0,35,35,0,20191231]
[null,"1","A01803","ADMINISTRATIVO ESPECIALIZADO","P",2,12,29,2,20190101,999999,0,565,0,35,35,0,20191231]
[null,"1","A01803","ADMINISTRATIVO ESPECIALIZADO","P",2,12,29,2,20190101,999999,0,565,0,35,35,0,20191231]
[null,"1","A01803","ADMINISTRATIVO ESPECIALIZADO","P",2,63,29,2,20190101,999999,0,615.84,0,35,35,0,20191231]
[null,"1","A01803","ADMINISTRATIVO ESPECIALIZADO","P",2,74,29,2,20190101,999999,0,686.66,0,35,35,0,20191231]
[null,"1","A01803","ADMINISTRATIVO ESPECIALIZADO","P",2,15,29,2,20190101,999999,0,189.81,0,35,35,0,20191231]
[null,"1","A01803","ADMINISTRATIVO ESPECIALIZADO","P",2,13,29,2,20190101,999999,0,60,0,35,35,0,20191231]
[null,"1","A01803","ADMINISTRATIVO ESPECIALIZADO","P",2,13,29,2,20190101,999999,0,80,0,35,35,0,20191231]
[null,"1","A01803","ADMINISTRATIVO ESPECIALIZADO","P",2,30,29,2,20190101,999999,0,291.42,0,35,35,0,20191231]
[null,"1","A01803","ADMINISTRATIVO ESPECIALIZADO","P",2,21,29,2,20190101,999999,0,2000,0,35,35,0,20191231]
[null,"1","A01803","ADMINISTRATIVO ESPECIALIZADO","P",2,100,29,2,20190101,999999,0,54.62,0,35,35,0,20191231]
[null,"1","A01803","ADMINISTRATIVO ESPECIALIZADO","P",2,100,29,2,20190101,999999,0,106.16,0,35,35,0,20191231]
[null,"1","A01803","ADMINISTRATIVO ESPECIALIZADO","P",2,100,29,2,20190101,999999,0,157.71,0,35,35,0,20191231]
[null,"1","A01803","ADMINISTRATIVO ESPECIALIZADO","P",2,100,29,2,20190101,999999,0,209.25,0,35,35,0,20191231]
[null,"1","A01803","ADMINISTRATIVO ESPECIALIZADO","P",2,100,29,2,20190101,999999,0,260.79000000000002,0,35,35,0,20191231]
[null,"1","A01803","ADMINISTRATIVO ESPECIALIZADO","P",2,100,29,2,20190101,999999,0,287.33,0,35,35,0,20191231]
[null,"1","A01803","ADMINISTRATIVO ESPECIALIZADO","P",2,100,29,2,20190101,999999,0,338.87,0,35,35,0,20191231]
[null,"1","A01803","ADMINISTRATIVO ESPECIALIZADO","P",2,100,29,2,20190101,999999,0,390.41,0,35,35,0,20191231]
[null,"1","A01803","ADMINISTRATIVO ESPECIALIZADO","P",2,100,29,2,20190101,999999,0,441.95,0,35,35,0,20191231]
[null,"1","A01803","ADMINISTRATIVO ESPECIALIZADO","P",2,100,29,2,20190101,999999,0,493.49,0,35,35,0,20191231]
[null,"1","A01803","ADMINISTRATIVO ESPECIALIZADO","P",2,100,29,2,20190101,999999,0,495.03,0,35,35,0,20191231]
[null,"1","A01803","ADMINISTRATIVO ESPECIALIZADO","P",2,100,29,2,20190101,999999,0,546.57000000000005,0,35,35,0,20191231]
[null,"1","A01803","ADMINISTRATIVO ESPECIALIZADO","P",2,100,29,2,20190101,999999,0,598.12,0,35,35,0,20191231]
[null,"1","A01803","ADMINISTRATIVO ESPECIALIZADO","P",2,100,29,2,20190101,999999,0,649.66,0,35,35,0,20191231]
[null,"1","A01803","ADMINISTRATIVO ESPECIALIZADO","P",2,100,29,2,20190101,999999,0,701.2,0,35,35,0,20191231]
[null,"1","A01803","ADMINISTRATIVO ESPECIALIZADO","P",2,100,29,2,20190101,999999,0,727.74,0,35,35,0,20191231]
[null,"1","A01803","ADMINISTRATIVO ESPECIALIZADO","P",2,100,29,2,20190101,999999,0,779.28,0,35,35,0,20191231]
[null,"1","A01803","ADMINISTRATIVO ESPECIALIZADO","P",2,100,29,2,20190101,999999,0,830.82,0,35,35,0,20191231]
[null,"1","A01803","ADMINISTRATIVO ESPECIALIZADO","P",2,100,29,2,20190101,999999,0,882.36,0,35,35,0,20191231]
[null,"1","A01803","ADMINISTRATIVO ESPECIALIZADO","P",2,100,29,2,20190101,999999,0,933.9,0,35,35,0,20191231]
[null,"1","A01803","ADMINISTRATIVO ESPECIALIZADO","P",2,100,29,2,20190101,999999,0,960.44,0,35,35,0,20191231]
[null,"1","A01803","ADMINISTRATIVO ESPECIALIZADO","P",2,100,29,2,20190101,999999,0,1011.98,0,35,35,0,20191231]
[null,"1","A01803","ADMINISTRATIVO ESPECIALIZADO","P",2,100,29,2,20190101,999999,0,1063.53,0,35,35,0,20191231]
[null,"1","A01803","ADMINISTRATIVO ESPECIALIZADO","P",2,100,29,2,20190101,999999,0,1115.07,0,35,35,0,20191231]
[null,"1","A01803","ADMINISTRATIVO ESPECIALIZADO","P",2,100,29,2,20190101,999999,0,1166.6099999999999,0,35,35,0,20191231]
[null,"1","A01803","ADMINISTRATIVO ESPECIALIZADO","P",2,100,29,2,20190101,999999,0,1218.1500000000001,0,35,35,0,20191231]
[null,"1","A01803","ADMINISTRATIVO ESPECIALIZADO","P",2,4,29,2,20190101,999999,0,200,0,35,35,0,20191231]
[null,"1","A01803","ADMINISTRATIVO ESPECIALIZADO","P",2,4,29,2,20190101,999999,0,225,0,35,35,0,20191231]
[null,"1","A01803","ADMINISTRATIVO ESPECIALIZADO","P",2,4,29,2,20190101,999999,0,125,0,35,35,0,20191231]
[null,"1","A01803","ADMINISTRATIVO ESPECIALIZADO","P",2,4,29,2,20190101,999999,0,175,0,35,35,0,20191231]
[null,"1","A01803","ADMINISTRATIVO ESPECIALIZADO","P",2,4,29,2,20190101,999999,0,100,0,35,35,0,20191231]
[null,"1","A01803","ADMINISTRATIVO ESPECIALIZADO","P",2,20,29,2,20190101,999999,0,1200,0,35,35,0,20191231]
[null,"1","A01803","ADMINISTRATIVO ESPECIALIZADO","P",2,20,29,2,20190101,999999,0,1200,0,35,35,0,20191231]
[null,"1","A01803","ADMINISTRATIVO ESPECIALIZADO","P",2,11,29,2,20190101,999999,0,565,0,35,35,0,20191231]
[null,"1","A01803","ADMINISTRATIVO ESPECIALIZADO","P",2,11,29,2,20190101,999999,0,565,0,35,35,0,20191231]
[null,"1","A01804","ADMINISTRATIVO ESPECIALIZADO","P",2,6,29,2,20190101,999999,0,7588,0,35,35,0,20191231]
[null,"1","A01805","ADMINISTRATIVO ESPECIALIZADO","P",2,5,29,2,20190101,999999,0,3414.24,0,35,35,0,20191231]
[null,"1","A01806","ADMINISTRATIVO ESPECIALIZADO","P",2,7,29,2,20190101,999999,0,1785,0,35,35,0,20191231]
[null,"1","A01807","ADMINISTRATIVO ESPECIALIZADO","P",2,31,29,2,20190101,999999,0,2276.16,0,35,35,0,20191231]
[null,"1","A01808","ADMINISTRATIVO ESPECIALIZADO","P",2,46,29,2,20190101,999999,0,714,0,35,35,0,20191231]
[null,"1","A01809","ADMINISTRATIVO ESPECIALIZADO","P",2,421,29,2,20190101,999999,0,892.5,0,35,35,0,20191231]
[null,"1","S01803","OFICIAL DE SERVICIOS Y MANTENIMIENTO","P",2,1,21,2,20190101,999999,0,6093.65,0,35,35,0,20191231]
[null,"1","S01803","OFICIAL DE SERVICIOS Y MANTENIMIENTO","P",2,9,21,2,20190101,999999,0,565,0,35,35,0,20191231]
[null,"1","S01803","OFICIAL DE SERVICIOS Y MANTENIMIENTO","P",2,9,21,2,20190101,999999,0,565,0,35,35,0,20191231]
[null,"1","S01803","OFICIAL DE SERVICIOS Y MANTENIMIENTO","P",2,12,21,2,20190101,999999,0,565,0,35,35,0,20191231]
[null,"1","S01803","OFICIAL DE SERVICIOS Y MANTENIMIENTO","P",2,12,21,2,20190101,999999,0,565,0,35,35,0,20191231]
[null,"1","S01803","OFICIAL DE SERVICIOS Y MANTENIMIENTO","P",2,63,21,2,20190101,999999,0,615.84,0,35,35,0,20191231]
[null,"1","S01803","OFICIAL DE SERVICIOS Y MANTENIMIENTO","P",2,74,21,2,20190101,999999,0,686.66,0,35,35,0,20191231]
[null,"1","S01803","OFICIAL DE SERVICIOS Y MANTENIMIENTO","P",2,15,21,2,20190101,999999,0,184.75,0,35,35,0,20191231]
[null,"1","S01803","OFICIAL DE SERVICIOS Y MANTENIMIENTO","P",2,13,21,2,20190101,999999,0,60,0,35,35,0,20191231]
[null,"1","S01803","OFICIAL DE SERVICIOS Y MANTENIMIENTO","P",2,13,21,2,20190101,999999,0,80,0,35,35,0,20191231]
[null,"1","S01803","OFICIAL DE SERVICIOS Y MANTENIMIENTO","P",2,30,21,2,20190101,999999,0,291.42,0,35,35,0,20191231]
[null,"1","S01803","OFICIAL DE SERVICIOS Y MANTENIMIENTO","P",2,21,21,2,20190101,999999,0,2000,0,35,35,0,20191231]
[null,"1","S01803","OFICIAL DE SERVICIOS Y MANTENIMIENTO","P",2,100,21,2,20190101,999999,0,54.62,0,35,35,0,20191231]
[null,"1","S01803","OFICIAL DE SERVICIOS Y MANTENIMIENTO","P",2,100,21,2,20190101,999999,0,106.16,0,35,35,0,20191231]
[null,"1","S01803","OFICIAL DE SERVICIOS Y MANTENIMIENTO","P",2,100,21,2,20190101,999999,0,157.71,0,35,35,0,20191231]
[null,"1","S01803","OFICIAL DE SERVICIOS Y MANTENIMIENTO","P",2,100,21,2,20190101,999999,0,209.25,0,35,35,0,20191231]
[null,"1","S01803","OFICIAL DE SERVICIOS Y MANTENIMIENTO","P",2,100,21,2,20190101,999999,0,260.79000000000002,0,35,35,0,20191231]
[null,"1","S01803","OFICIAL DE SERVICIOS Y MANTENIMIENTO","P",2,100,21,2,20190101,999999,0,287.33,0,35,35,0,20191231]
[null,"1","S01803","OFICIAL DE SERVICIOS Y MANTENIMIENTO","P",2,100,21,2,20190101,999999,0,338.87,0,35,35,0,20191231]
[null,"1","S01803","OFICIAL DE SERVICIOS Y MANTENIMIENTO","P",2,100,21,2,20190101,999999,0,390.41,0,35,35,0,20191231]
[null,"1","S01803","OFICIAL DE SERVICIOS Y MANTENIMIENTO","P",2,100,21,2,20190101,999999,0,441.95,0,35,35,0,20191231]
[null,"1","S01803","OFICIAL DE SERVICIOS Y MANTENIMIENTO","P",2,100,21,2,20190101,999999,0,493.49,0,35,35,0,20191231]
[null,"1","S01803","OFICIAL DE SERVICIOS Y MANTENIMIENTO","P",2,100,21,2,20190101,999999,0,495.03,0,35,35,0,20191231]
[null,"1","S01803","OFICIAL DE SERVICIOS Y MANTENIMIENTO","P",2,100,21,2,20190101,999999,0,546.57000000000005,0,35,35,0,20191231]
[null,"1","S01803","OFICIAL DE SERVICIOS Y MANTENIMIENTO","P",2,100,21,2,20190101,999999,0,598.12,0,35,35,0,20191231]
[null,"1","S01803","OFICIAL DE SERVICIOS Y MANTENIMIENTO","P",2,100,21,2,20190101,999999,0,649.66,0,35,35,0,20191231]
[null,"1","S01803","OFICIAL DE SERVICIOS Y MANTENIMIENTO","P",2,100,21,2,20190101,999999,0,701.2,0,35,35,0,20191231]
[null,"1","S01803","OFICIAL DE SERVICIOS Y MANTENIMIENTO","P",2,100,21,2,20190101,999999,0,727.74,0,35,35,0,20191231]
[null,"1","S01803","OFICIAL DE SERVICIOS Y MANTENIMIENTO","P",2,100,21,2,20190101,999999,0,779.28,0,35,35,0,20191231]
[null,"1","S01803","OFICIAL DE SERVICIOS Y MANTENIMIENTO","P",2,100,21,2,20190101,999999,0,830.82,0,35,35,0,20191231]
[null,"1","S01803","OFICIAL DE SERVICIOS Y MANTENIMIENTO","P",2,100,21,2,20190101,999999,0,882.36,0,35,35,0,20191231]
[null,"1","S01803","OFICIAL DE SERVICIOS Y MANTENIMIENTO","P",2,100,21,2,20190101,999999,0,933.9,0,35,35,0,20191231]
[null,"1","S01803","OFICIAL DE SERVICIOS Y MANTENIMIENTO","P",2,100,21,2,20190101,999999,0,960.44,0,35,35,0,20191231]
[null,"1","S01803","OFICIAL DE SERVICIOS Y MANTENIMIENTO","P",2,100,21,2,20190101,999999,0,1011.98,0,35,35,0,20191231]
[null,"1","S01803","OFICIAL DE SERVICIOS Y MANTENIMIENTO","P",2,100,21,2,20190101,999999,0,1063.53,0,35,35,0,20191231]
[null,"1","S01803","OFICIAL DE SERVICIOS Y MANTENIMIENTO","P",2,100,21,2,20190101,999999,0,1115.07,0,35,35,0,20191231]
[null,"1","S01803","OFICIAL DE SERVICIOS Y MANTENIMIENTO","P",2,100,21,2,20190101,999999,0,1166.6099999999999,0,35,35,0,20191231]
[null,"1","S01803","OFICIAL DE SERVICIOS Y MANTENIMIENTO","P",2,100,21,2,20190101,999999,0,1218.1500000000001,0,35,35,0,20191231]
[null,"1","S01803","OFICIAL DE SERVICIOS Y MANTENIMIENTO","P",2,4,21,2,20190101,999999,0,200,0,35,35,0,20191231]
[null,"1","S01803","OFICIAL DE SERVICIOS Y MANTENIMIENTO","P",2,4,21,2,20190101,999999,0,225,0,35,35,0,20191231]
[null,"1","S01803","OFICIAL DE SERVICIOS Y MANTENIMIENTO","P",2,4,21,2,20190101,999999,0,100,0,35,35,0,20191231]
[null,"1","S01803","OFICIAL DE SERVICIOS Y MANTENIMIENTO","P",2,4,21,2,20190101,999999,0,32.5,0,35,35,0,20191231]
[null,"1","S01803","OFICIAL DE SERVICIOS Y MANTENIMIENTO","P",2,4,21,2,20190101,999999,0,175,0,35,35,0,20191231]
[null,"1","S01803","OFICIAL DE SERVICIOS Y MANTENIMIENTO","P",2,20,21,2,20190101,999999,0,1200,0,35,35,0,20191231]
[null,"1","S01803","OFICIAL DE SERVICIOS Y MANTENIMIENTO","P",2,20,21,2,20190101,999999,0,1200,0,35,35,0,20191231]
[null,"1","S01803","OFICIAL DE SERVICIOS Y MANTENIMIENTO","P",2,11,21,2,20190101,999999,0,565,0,35,35,0,20191231]
[null,"1","S01803","OFICIAL DE SERVICIOS Y MANTENIMIENTO","P",2,11,21,2,20190101,999999,0,565,0,35,35,0,20191231]
[null,"1","S01804","OFICIAL DE SERVICIOS Y MANTENIMIENTO","P",2,6,21,2,20190101,999999,0,7390.05,0,35,35,0,20191231]
[null,"1","S01805","OFICIAL DE SERVICIOS Y MANTENIMIENTO","P",2,5,21,2,20190101,999999,0,1662.76,0,35,35,0,20191231]
[null,"1","S01806","OFICIAL DE SERVICIOS Y MANTENIMIENTO","P",2,7,21,2,20190101,999999,0,1785,0,35,35,0,20191231]
[null,"1","S01807","OFICIAL DE SERVICIOS Y MANTENIMIENTO","P",2,31,21,2,20190101,999999,0,2217.0100000000002,0,35,35,0,20191231]
[null,"1","S01808","OFICIAL DE SERVICIOS Y MANTENIMIENTO","P",2,46,21,2,20190101,999999,0,714,0,35,35,0,20191231]
[null,"1","S01809","OFICIAL DE SERVICIOS Y MANTENIMIENTO","P",2,421,21,2,20190101,999999,0,892.5,0,35,35,0,20191231]
[null,"1","A01805","AUXILIAR DE ADMINISTRADOR","P",2,1,46,2,20190101,999999,0,6093.65,0,35,35,0,20191231]
[null,"1","A01805","AUXILIAR DE ADMINISTRADOR","P",2,9,46,2,20190101,999999,0,565,0,35,35,0,20191231]
[null,"1","A01805","AUXILIAR DE ADMINISTRADOR","P",2,9,46,2,20190101,999999,0,565,0,35,35,0,20191231]
[null,"1","A01805","AUXILIAR DE ADMINISTRADOR","P",2,12,46,2,20190101,999999,0,565,0,35,35,0,20191231]
[null,"1","A01805","AUXILIAR DE ADMINISTRADOR","P",2,12,46,2,20190101,999999,0,565,0,35,35,0,20191231]
[null,"1","A01805","AUXILIAR DE ADMINISTRADOR","P",2,15,46,2,20190101,999999,0,184.75,0,35,35,0,20191231]
[null,"1","A01805","AUXILIAR DE ADMINISTRADOR","P",2,13,46,2,20190101,999999,0,60,0,35,35,0,20191231]
[null,"1","A01805","AUXILIAR DE ADMINISTRADOR","P",2,13,46,2,20190101,999999,0,80,0,35,35,0,20191231]
[null,"1","A01805","AUXILIAR DE ADMINISTRADOR","P",2,20,46,2,20190101,999999,0,1200,0,35,35,0,20191231]
[null,"1","A01805","AUXILIAR DE ADMINISTRADOR","P",2,20,46,2,20190101,999999,0,1200,0,35,35,0,20191231]
[null,"1","A01805","AUXILIAR DE ADMINISTRADOR","P",2,11,46,2,20190101,999999,0,565,0,35,35,0,20191231]
[null,"1","A01805","AUXILIAR DE ADMINISTRADOR","P",2,11,46,2,20190101,999999,0,565,0,35,35,0,20191231]
[null,"1","A01806","AUXILIAR DE ADMINISTRADOR","P",2,6,46,2,20190101,999999,0,7390,0,35,35,0,20191231]
[null,"1","A01807","AUXILIAR DE ADMINISTRADOR","P",2,5,46,2,20190101,999999,0,1662.75,0,35,35,0,20191231]
[null,"1","A01808","AUXILIAR DE ADMINISTRADOR","P",2,7,46,2,20190101,999999,0,1785,0,35,35,0,20191231]
[null,"1","A01809","AUXILIAR DE ADMINISTRADOR","P",2,31,46,2,20190101,999999,0,2217,0,35,35,0,20191231]
[null,"1","A01810","AUXILIAR DE ADMINISTRADOR","P",2,46,46,2,20190101,999999,0,714,0,35,35,0,20191231]
[null,"1","A01811","AUXILIAR DE ADMINISTRADOR","P",2,421,46,2,20190101,999999,0,892.5,0,35,35,0,20191231]
[null,"1","T03803","TECNICO MEDIO","P",2,1,47,2,20190101,999999,0,6093.65,0,35,35,0,20191231]
[null,"1","T03803","TECNICO MEDIO","P",2,9,47,2,20190101,999999,0,565,0,35,35,0,20191231]
[null,"1","T03803","TECNICO MEDIO","P",2,9,47,2,20190101,999999,0,565,0,35,35,0,20191231]
[null,"1","T03803","TECNICO MEDIO","P",2,12,47,2,20190101,999999,0,565,0,35,35,0,20191231]
[null,"1","T03803","TECNICO MEDIO","P",2,12,47,2,20190101,999999,0,565,0,35,35,0,20191231]
[null,"1","T03803","TECNICO MEDIO","P",2,63,47,2,20190101,999999,0,615.84,0,35,35,0,20191231]
[null,"1","T03803","TECNICO MEDIO","P",2,74,47,2,20190101,999999,0,686.66,0,35,35,0,20191231]
[null,"1","T03803","TECNICO MEDIO","P",2,15,47,2,20190101,999999,0,184.75,0,35,35,0,20191231]
[null,"1","T03803","TECNICO MEDIO","P",2,13,47,2,20190101,999999,0,60,0,35,35,0,20191231]
[null,"1","T03803","TECNICO MEDIO","P",2,13,47,2,20190101,999999,0,80,0,35,35,0,20191231]
[null,"1","T03803","TECNICO MEDIO","P",2,30,47,2,20190101,999999,0,291.42,0,35,35,0,20191231]
[null,"1","T03803","TECNICO MEDIO","P",2,21,47,2,20190101,999999,0,2000,0,35,35,0,20191231]
[null,"1","T03803","TECNICO MEDIO","P",2,100,47,2,20190101,999999,0,54.62,0,35,35,0,20191231]
[null,"1","T03803","TECNICO MEDIO","P",2,100,47,2,20190101,999999,0,106.16,0,35,35,0,20191231]
[null,"1","T03803","TECNICO MEDIO","P",2,100,47,2,20190101,999999,0,157.71,0,35,35,0,20191231]
[null,"1","T03803","TECNICO MEDIO","P",2,100,47,2,20190101,999999,0,209.25,0,35,35,0,20191231]
[null,"1","T03803","TECNICO MEDIO","P",2,100,47,2,20190101,999999,0,260.79000000000002,0,35,35,0,20191231]
[null,"1","T03803","TECNICO MEDIO","P",2,100,47,2,20190101,999999,0,287.33,0,35,35,0,20191231]
[null,"1","T03803","TECNICO MEDIO","P",2,100,47,2,20190101,999999,0,338.87,0,35,35,0,20191231]
[null,"1","T03803","TECNICO MEDIO","P",2,100,47,2,20190101,999999,0,390.41,0,35,35,0,20191231]
[null,"1","T03803","TECNICO MEDIO","P",2,100,47,2,20190101,999999,0,441.95,0,35,35,0,20191231]
[null,"1","T03803","TECNICO MEDIO","P",2,100,47,2,20190101,999999,0,493.49,0,35,35,0,20191231]
[null,"1","T03803","TECNICO MEDIO","P",2,100,47,2,20190101,999999,0,495.03,0,35,35,0,20191231]
[null,"1","T03803","TECNICO MEDIO","P",2,100,47,2,20190101,999999,0,546.57000000000005,0,35,35,0,20191231]
[null,"1","T03803","TECNICO MEDIO","P",2,100,47,2,20190101,999999,0,598.12,0,35,35,0,20191231]
[null,"1","T03803","TECNICO MEDIO","P",2,100,47,2,20190101,999999,0,649.66,0,35,35,0,20191231]
[null,"1","T03803","TECNICO MEDIO","P",2,100,47,2,20190101,999999,0,701.2,0,35,35,0,20191231]
[null,"1","T03803","TECNICO MEDIO","P",2,100,47,2,20190101,999999,0,727.74,0,35,35,0,20191231]
[null,"1","T03803","TECNICO MEDIO","P",2,100,47,2,20190101,999999,0,779.28,0,35,35,0,20191231]
[null,"1","T03803","TECNICO MEDIO","P",2,100,47,2,20190101,999999,0,830.82,0,35,35,0,20191231]
[null,"1","T03803","TECNICO MEDIO","P",2,100,47,2,20190101,999999,0,882.36,0,35,35,0,20191231]
[null,"1","T03803","TECNICO MEDIO","P",2,100,47,2,20190101,999999,0,933.9,0,35,35,0,20191231]
[null,"1","T03803","TECNICO MEDIO","P",2,100,47,2,20190101,999999,0,960.44,0,35,35,0,20191231]
[null,"1","T03803","TECNICO MEDIO","P",2,100,47,2,20190101,999999,0,1011.98,0,35,35,0,20191231]
[null,"1","T03803","TECNICO MEDIO","P",2,100,47,2,20190101,999999,0,1063.53,0,35,35,0,20191231]
[null,"1","T03803","TECNICO MEDIO","P",2,100,47,2,20190101,999999,0,1115.07,0,35,35,0,20191231]
[null,"1","T03803","TECNICO MEDIO","P",2,100,47,2,20190101,999999,0,1166.6099999999999,0,35,35,0,20191231]
[null,"1","T03803","TECNICO MEDIO","P",2,100,47,2,20190101,999999,0,1218.1500000000001,0,35,35,0,20191231]
[null,"1","T03803","TECNICO MEDIO","P",2,4,47,2,20190101,999999,0,200,0,35,35,0,20191231]
[null,"1","T03803","TECNICO MEDIO","P",2,4,47,2,20190101,999999,0,225,0,35,35,0,20191231]
[null,"1","T03803","TECNICO MEDIO","P",2,4,47,2,20190101,999999,0,125,0,35,35,0,20191231]
[null,"1","T03803","TECNICO MEDIO","P",2,4,47,2,20190101,999999,0,175,0,35,35,0,20191231]
[null,"1","T03803","TECNICO MEDIO","P",2,4,47,2,20190101,999999,0,100,0,35,35,0,20191231]
[null,"1","T03803","TECNICO MEDIO","P",2,20,47,2,20190101,999999,0,1200,0,35,35,0,20191231]
[null,"1","T03803","TECNICO MEDIO","P",2,20,47,2,20190101,999999,0,1200,0,35,35,0,20191231]
[null,"1","T03803","TECNICO MEDIO","P",2,11,47,2,20190101,999999,0,565,0,35,35,0,20191231]
[null,"1","T03803","TECNICO MEDIO","P",2,11,47,2,20190101,999999,0,565,0,35,35,0,20191231]
[null,"1","T03804","TECNICO MEDIO","P",2,6,47,2,20190101,999999,0,7390,0,35,35,0,20191231]
[null,"1","T03805","TECNICO MEDIO","P",2,5,47,2,20190101,999999,0,1662.75,0,35,35,0,20191231]
[null,"1","T03806","TECNICO MEDIO","P",2,7,47,2,20190101,999999,0,1785,0,35,35,0,20191231]
[null,"1","T03807","TECNICO MEDIO","P",2,31,47,2,20190101,999999,0,2217,0,35,35,0,20191231]
[null,"1","T03808","TECNICO MEDIO","P",2,46,47,2,20190101,999999,0,714,0,35,35,0,20191231]
[null,"1","T03809","TECNICO MEDIO","P",2,421,47,2,20190101,999999,0,892.5,0,35,35,0,20191231]
[null,"1","T03804","SECRETARIA C","P",2,1,43,2,20190101,999999,0,6093.65,0,35,35,0,20191231]
[null,"1","T03804","SECRETARIA C","P",2,9,43,2,20190101,999999,0,565,0,35,35,0,20191231]
[null,"1","T03804","SECRETARIA C","P",2,9,43,2,20190101,999999,0,565,0,35,35,0,20191231]
[null,"1","T03804","SECRETARIA C","P",2,12,43,2,20190101,999999,0,565,0,35,35,0,20191231]
[null,"1","T03804","SECRETARIA C","P",2,12,43,2,20190101,999999,0,565,0,35,35,0,20191231]
[null,"1","T03804","SECRETARIA C","P",2,63,43,2,20190101,999999,0,615.84,0,35,35,0,20191231]
[null,"1","T03804","SECRETARIA C","P",2,74,43,2,20190101,999999,0,686.66,0,35,35,0,20191231]
[null,"1","T03804","SECRETARIA C","P",2,15,43,2,20190101,999999,0,184.75,0,35,35,0,20191231]
[null,"1","T03804","SECRETARIA C","P",2,13,43,2,20190101,999999,0,60,0,35,35,0,20191231]
[null,"1","T03804","SECRETARIA C","P",2,13,43,2,20190101,999999,0,80,0,35,35,0,20191231]
[null,"1","T03804","SECRETARIA C","P",2,30,43,2,20190101,999999,0,291.42,0,35,35,0,20191231]
[null,"1","T03804","SECRETARIA C","P",2,21,43,2,20190101,999999,0,2000,0,35,35,0,20191231]
[null,"1","T03804","SECRETARIA C","P",2,100,43,2,20190101,999999,0,54.62,0,35,35,0,20191231]
[null,"1","T03804","SECRETARIA C","P",2,100,43,2,20190101,999999,0,106.16,0,35,35,0,20191231]
[null,"1","T03804","SECRETARIA C","P",2,100,43,2,20190101,999999,0,157.71,0,35,35,0,20191231]
[null,"1","T03804","SECRETARIA C","P",2,100,43,2,20190101,999999,0,209.25,0,35,35,0,20191231]
[null,"1","T03804","SECRETARIA C","P",2,100,43,2,20190101,999999,0,260.79000000000002,0,35,35,0,20191231]
[null,"1","T03804","SECRETARIA C","P",2,100,43,2,20190101,999999,0,287.33,0,35,35,0,20191231]
[null,"1","T03804","SECRETARIA C","P",2,100,43,2,20190101,999999,0,338.87,0,35,35,0,20191231]
[null,"1","T03804","SECRETARIA C","P",2,100,43,2,20190101,999999,0,390.41,0,35,35,0,20191231]
[null,"1","T03804","SECRETARIA C","P",2,100,43,2,20190101,999999,0,441.95,0,35,35,0,20191231]
[null,"1","T03804","SECRETARIA C","P",2,100,43,2,20190101,999999,0,493.49,0,35,35,0,20191231]
[null,"1","T03804","SECRETARIA C","P",2,100,43,2,20190101,999999,0,495.03,0,35,35,0,20191231]
[null,"1","T03804","SECRETARIA C","P",2,100,43,2,20190101,999999,0,546.57000000000005,0,35,35,0,20191231]
[null,"1","T03804","SECRETARIA C","P",2,100,43,2,20190101,999999,0,598.12,0,35,35,0,20191231]
[null,"1","T03804","SECRETARIA C","P",2,100,43,2,20190101,999999,0,649.66,0,35,35,0,20191231]
[null,"1","T03804","SECRETARIA C","P",2,100,43,2,20190101,999999,0,701.2,0,35,35,0,20191231]
[null,"1","T03804","SECRETARIA C","P",2,100,43,2,20190101,999999,0,727.74,0,35,35,0,20191231]
[null,"1","T03804","SECRETARIA C","P",2,100,43,2,20190101,999999,0,779.28,0,35,35,0,20191231]
[null,"1","T03804","SECRETARIA C","P",2,100,43,2,20190101,999999,0,830.82,0,35,35,0,20191231]
[null,"1","T03804","SECRETARIA C","P",2,100,43,2,20190101,999999,0,882.36,0,35,35,0,20191231]
[null,"1","T03804","SECRETARIA C","P",2,100,43,2,20190101,999999,0,933.9,0,35,35,0,20191231]
[null,"1","T03804","SECRETARIA C","P",2,100,43,2,20190101,999999,0,960.44,0,35,35,0,20191231]
[null,"1","T03804","SECRETARIA C","P",2,100,43,2,20190101,999999,0,1011.98,0,35,35,0,20191231]
[null,"1","T03804","SECRETARIA C","P",2,100,43,2,20190101,999999,0,1063.53,0,35,35,0,20191231]
[null,"1","T03804","SECRETARIA C","P",2,100,43,2,20190101,999999,0,1115.07,0,35,35,0,20191231]
[null,"1","T03804","SECRETARIA C","P",2,100,43,2,20190101,999999,0,1166.6099999999999,0,35,35,0,20191231]
[null,"1","T03804","SECRETARIA C","P",2,100,43,2,20190101,999999,0,1218.1500000000001,0,35,35,0,20191231]
[null,"1","T03804","SECRETARIA C","P",2,4,43,2,20190101,999999,0,200,0,35,35,0,20191231]
[null,"1","T03804","SECRETARIA C","P",2,4,43,2,20190101,999999,0,225,0,35,35,0,20191231]
[null,"1","T03804","SECRETARIA C","P",2,4,43,2,20190101,999999,0,100,0,35,35,0,20191231]
[null,"1","T03804","SECRETARIA C","P",2,4,43,2,20190101,999999,0,125,0,35,35,0,20191231]
[null,"1","T03804","SECRETARIA C","P",2,4,43,2,20190101,999999,0,175,0,35,35,0,20191231]
[null,"1","T03804","SECRETARIA C","P",2,20,43,2,20190101,999999,0,1200,0,35,35,0,20191231]
[null,"1","T03804","SECRETARIA C","P",2,20,43,2,20190101,999999,0,1200,0,35,35,0,20191231]
[null,"1","T03804","SECRETARIA C","P",2,11,43,2,20190101,999999,0,565,0,35,35,0,20191231]
[null,"1","T03804","SECRETARIA C","P",2,11,43,2,20190101,999999,0,565,0,35,35,0,20191231]
[null,"1","T03805","SECRETARIA C","P",2,6,43,2,20190101,999999,0,7390,0,35,35,0,20191231]
[null,"1","T03806","SECRETARIA C","P",2,5,43,2,20190101,999999,0,1662.75,0,35,35,0,20191231]
[null,"1","T03807","SECRETARIA C","P",2,7,43,2,20190101,999999,0,1785,0,35,35,0,20191231]
[null,"1","T03808","SECRETARIA C","P",2,31,43,2,20190101,999999,0,2217,0,35,35,0,20191231]
[null,"1","T03809","SECRETARIA C","P",2,46,43,2,20190101,999999,0,714,0,35,35,0,20191231]
[null,"1","T03810","SECRETARIA C","P",2,421,43,2,20190101,999999,0,892.5,0,35,35,0,20191231]
[null,"1","T03810","ESPECIALISTA EN PROYECTOS TECNICOS","P",2,1,59,2,20190101,999999,0,6093.65,0,35,35,0,20191231]
[null,"1","T03810","ESPECIALISTA EN PROYECTOS TECNICOS","P",2,9,59,2,20190101,999999,0,565,0,35,35,0,20191231]
[null,"1","T03810","ESPECIALISTA EN PROYECTOS TECNICOS","P",2,9,59,2,20190101,999999,0,565,0,35,35,0,20191231]
[null,"1","T03810","ESPECIALISTA EN PROYECTOS TECNICOS","P",2,12,59,2,20190101,999999,0,565,0,35,35,0,20191231]
[null,"1","T03810","ESPECIALISTA EN PROYECTOS TECNICOS","P",2,12,59,2,20190101,999999,0,565,0,35,35,0,20191231]
[null,"1","T03810","ESPECIALISTA EN PROYECTOS TECNICOS","P",2,63,59,2,20190101,999999,0,615.84,0,35,35,0,20191231]
[null,"1","T03810","ESPECIALISTA EN PROYECTOS TECNICOS","P",2,74,59,2,20190101,999999,0,686.66,0,35,35,0,20191231]
[null,"1","T03810","ESPECIALISTA EN PROYECTOS TECNICOS","P",2,15,59,2,20190101,999999,0,184.75,0,35,35,0,20191231]
[null,"1","T03810","ESPECIALISTA EN PROYECTOS TECNICOS","P",2,13,59,2,20190101,999999,0,80,0,35,35,0,20191231]
[null,"1","T03810","ESPECIALISTA EN PROYECTOS TECNICOS","P",2,30,59,2,20190101,999999,0,291.42,0,35,35,0,20191231]
[null,"1","T03810","ESPECIALISTA EN PROYECTOS TECNICOS","P",2,21,59,2,20190101,999999,0,2000,0,35,35,0,20191231]
[null,"1","T03810","ESPECIALISTA EN PROYECTOS TECNICOS","P",2,100,59,2,20190101,999999,0,54.62,0,35,35,0,20191231]
[null,"1","T03810","ESPECIALISTA EN PROYECTOS TECNICOS","P",2,100,59,2,20190101,999999,0,106.16,0,35,35,0,20191231]
[null,"1","T03810","ESPECIALISTA EN PROYECTOS TECNICOS","P",2,100,59,2,20190101,999999,0,157.71,0,35,35,0,20191231]
[null,"1","T03810","ESPECIALISTA EN PROYECTOS TECNICOS","P",2,100,59,2,20190101,999999,0,209.25,0,35,35,0,20191231]
[null,"1","T03810","ESPECIALISTA EN PROYECTOS TECNICOS","P",2,100,59,2,20190101,999999,0,260.79000000000002,0,35,35,0,20191231]
[null,"1","T03810","ESPECIALISTA EN PROYECTOS TECNICOS","P",2,100,59,2,20190101,999999,0,287.33,0,35,35,0,20191231]
[null,"1","T03810","ESPECIALISTA EN PROYECTOS TECNICOS","P",2,100,59,2,20190101,999999,0,338.87,0,35,35,0,20191231]
[null,"1","T03810","ESPECIALISTA EN PROYECTOS TECNICOS","P",2,100,59,2,20190101,999999,0,390.41,0,35,35,0,20191231]
[null,"1","T03810","ESPECIALISTA EN PROYECTOS TECNICOS","P",2,100,59,2,20190101,999999,0,441.95,0,35,35,0,20191231]
[null,"1","T03810","ESPECIALISTA EN PROYECTOS TECNICOS","P",2,100,59,2,20190101,999999,0,493.49,0,35,35,0,20191231]
[null,"1","T03810","ESPECIALISTA EN PROYECTOS TECNICOS","P",2,100,59,2,20190101,999999,0,495.03,0,35,35,0,20191231]
[null,"1","T03810","ESPECIALISTA EN PROYECTOS TECNICOS","P",2,100,59,2,20190101,999999,0,546.57000000000005,0,35,35,0,20191231]
[null,"1","T03810","ESPECIALISTA EN PROYECTOS TECNICOS","P",2,100,59,2,20190101,999999,0,598.12,0,35,35,0,20191231]
[null,"1","T03810","ESPECIALISTA EN PROYECTOS TECNICOS","P",2,100,59,2,20190101,999999,0,649.66,0,35,35,0,20191231]
[null,"1","T03810","ESPECIALISTA EN PROYECTOS TECNICOS","P",2,100,59,2,20190101,999999,0,701.2,0,35,35,0,20191231]
[null,"1","T03810","ESPECIALISTA EN PROYECTOS TECNICOS","P",2,100,59,2,20190101,999999,0,727.74,0,35,35,0,20191231]
[null,"1","T03810","ESPECIALISTA EN PROYECTOS TECNICOS","P",2,100,59,2,20190101,999999,0,779.28,0,35,35,0,20191231]
[null,"1","T03810","ESPECIALISTA EN PROYECTOS TECNICOS","P",2,100,59,2,20190101,999999,0,830.82,0,35,35,0,20191231]
[null,"1","T03810","ESPECIALISTA EN PROYECTOS TECNICOS","P",2,100,59,2,20190101,999999,0,882.36,0,35,35,0,20191231]
[null,"1","T03810","ESPECIALISTA EN PROYECTOS TECNICOS","P",2,100,59,2,20190101,999999,0,933.9,0,35,35,0,20191231]
[null,"1","T03810","ESPECIALISTA EN PROYECTOS TECNICOS","P",2,100,59,2,20190101,999999,0,960.44,0,35,35,0,20191231]
[null,"1","T03810","ESPECIALISTA EN PROYECTOS TECNICOS","P",2,100,59,2,20190101,999999,0,1011.98,0,35,35,0,20191231]
[null,"1","T03810","ESPECIALISTA EN PROYECTOS TECNICOS","P",2,100,59,2,20190101,999999,0,1063.53,0,35,35,0,20191231]
[null,"1","T03810","ESPECIALISTA EN PROYECTOS TECNICOS","P",2,100,59,2,20190101,999999,0,1115.07,0,35,35,0,20191231]
[null,"1","T03810","ESPECIALISTA EN PROYECTOS TECNICOS","P",2,100,59,2,20190101,999999,0,1166.6099999999999,0,35,35,0,20191231]
[null,"1","T03810","ESPECIALISTA EN PROYECTOS TECNICOS","P",2,100,59,2,20190101,999999,0,1218.1500000000001,0,35,35,0,20191231]
[null,"1","T03810","ESPECIALISTA EN PROYECTOS TECNICOS","P",2,4,59,2,20190101,999999,0,200,0,35,35,0,20191231]
[null,"1","T03810","ESPECIALISTA EN PROYECTOS TECNICOS","P",2,4,59,2,20190101,999999,0,225,0,35,35,0,20191231]
[null,"1","T03810","ESPECIALISTA EN PROYECTOS TECNICOS","P",2,4,59,2,20190101,999999,0,175,0,35,35,0,20191231]
[null,"1","T03810","ESPECIALISTA EN PROYECTOS TECNICOS","P",2,4,59,2,20190101,999999,0,125,0,35,35,0,20191231]
[null,"1","T03810","ESPECIALISTA EN PROYECTOS TECNICOS","P",2,4,59,2,20190101,999999,0,100,0,35,35,0,20191231]
[null,"1","T03810","ESPECIALISTA EN PROYECTOS TECNICOS","P",2,20,59,2,20190101,999999,0,1200,0,35,35,0,20191231]
[null,"1","T03810","ESPECIALISTA EN PROYECTOS TECNICOS","P",2,20,59,2,20190101,999999,0,1200,0,35,35,0,20191231]
[null,"1","T03810","ESPECIALISTA EN PROYECTOS TECNICOS","P",2,11,59,2,20190101,999999,0,565,0,35,35,0,20191231]
[null,"1","T03810","ESPECIALISTA EN PROYECTOS TECNICOS","P",2,11,59,2,20190101,999999,0,565,0,35,35,0,20191231]
[null,"1","T03811","ESPECIALISTA EN PROYECTOS TECNICOS","P",2,6,59,2,20190101,999999,0,7390,0,35,35,0,20191231]
[null,"1","T03812","ESPECIALISTA EN PROYECTOS TECNICOS","P",2,5,59,2,20190101,999999,0,1662.75,0,35,35,0,20191231]
[null,"1","T03813","ESPECIALISTA EN PROYECTOS TECNICOS","P",2,7,59,2,20190101,999999,0,1785,0,35,35,0,20191231]
[null,"1","T03814","ESPECIALISTA EN PROYECTOS TECNICOS","P",2,31,59,2,20190101,999999,0,2217,0,35,35,0,20191231]
[null,"1","T03815","ESPECIALISTA EN PROYECTOS TECNICOS","P",2,46,59,2,20190101,999999,0,714,0,35,35,0,20191231]
[null,"1","T03816","ESPECIALISTA EN PROYECTOS TECNICOS","P",2,421,59,2,20190101,999999,0,892.5,0,35,35,0,20191231]
[null,"1","A01806","ANALISTA ADMINISTRATIVO","P",2,1,70,3,20190101,999999,0,6093.65,0,35,35,0,20191231]
[null,"1","A01806","ANALISTA ADMINISTRATIVO","P",2,9,70,3,20190101,999999,0,565,0,35,35,0,20191231]
[null,"1","A01806","ANALISTA ADMINISTRATIVO","P",2,9,70,3,20190101,999999,0,565,0,35,35,0,20191231]
[null,"1","A01806","ANALISTA ADMINISTRATIVO","P",2,12,70,3,20190101,999999,0,565,0,35,35,0,20191231]
[null,"1","A01806","ANALISTA ADMINISTRATIVO","P",2,12,70,3,20190101,999999,0,565,0,35,35,0,20191231]
[null,"1","A01806","ANALISTA ADMINISTRATIVO","P",2,63,70,3,20190101,999999,0,632.28,0,35,35,0,20191231]
[null,"1","A01806","ANALISTA ADMINISTRATIVO","P",2,74,70,3,20190101,999999,0,704.98,0,35,35,0,20191231]
[null,"1","A01806","ANALISTA ADMINISTRATIVO","P",2,15,70,3,20190101,999999,0,189.68,0,35,35,0,20191231]
[null,"1","A01806","ANALISTA ADMINISTRATIVO","P",2,13,70,3,20190101,999999,0,80,0,35,35,0,20191231]
[null,"1","A01806","ANALISTA ADMINISTRATIVO","P",2,30,70,3,20190101,999999,0,291.42,0,35,35,0,20191231]
[null,"1","A01806","ANALISTA ADMINISTRATIVO","P",2,21,70,3,20190101,999999,0,2000,0,35,35,0,20191231]
[null,"1","A01806","ANALISTA ADMINISTRATIVO","P",2,100,70,3,20190101,999999,0,58.75,0,35,35,0,20191231]
[null,"1","A01806","ANALISTA ADMINISTRATIVO","P",2,100,70,3,20190101,999999,0,111.67,0,35,35,0,20191231]
[null,"1","A01806","ANALISTA ADMINISTRATIVO","P",2,100,70,3,20190101,999999,0,164.58,0,35,35,0,20191231]
[null,"1","A01806","ANALISTA ADMINISTRATIVO","P",2,100,70,3,20190101,999999,0,217.5,0,35,35,0,20191231]
[null,"1","A01806","ANALISTA ADMINISTRATIVO","P",2,100,70,3,20190101,999999,0,270.41000000000003,0,35,35,0,20191231]
[null,"1","A01806","ANALISTA ADMINISTRATIVO","P",2,100,70,3,20190101,999999,0,298.33,0,35,35,0,20191231]
[null,"1","A01806","ANALISTA ADMINISTRATIVO","P",2,100,70,3,20190101,999999,0,351.25,0,35,35,0,20191231]
[null,"1","A01806","ANALISTA ADMINISTRATIVO","P",2,100,70,3,20190101,999999,0,404.16,0,35,35,0,20191231]
[null,"1","A01806","ANALISTA ADMINISTRATIVO","P",2,100,70,3,20190101,999999,0,457.08,0,35,35,0,20191231]
[null,"1","A01806","ANALISTA ADMINISTRATIVO","P",2,100,70,3,20190101,999999,0,510,0,35,35,0,20191231]
[null,"1","A01806","ANALISTA ADMINISTRATIVO","P",2,100,70,3,20190101,999999,0,512.91,0,35,35,0,20191231]
[null,"1","A01806","ANALISTA ADMINISTRATIVO","P",2,100,70,3,20190101,999999,0,565.83000000000004,0,35,35,0,20191231]
[null,"1","A01806","ANALISTA ADMINISTRATIVO","P",2,100,70,3,20190101,999999,0,618.75,0,35,35,0,20191231]
[null,"1","A01806","ANALISTA ADMINISTRATIVO","P",2,100,70,3,20190101,999999,0,671.66,0,35,35,0,20191231]
[null,"1","A01806","ANALISTA ADMINISTRATIVO","P",2,100,70,3,20190101,999999,0,724.68,0,35,35,0,20191231]
[null,"1","A01806","ANALISTA ADMINISTRATIVO","P",2,100,70,3,20190101,999999,0,752.5,0,35,35,0,20191231]
[null,"1","A01806","ANALISTA ADMINISTRATIVO","P",2,100,70,3,20190101,999999,0,805.41,0,35,35,0,20191231]
[null,"1","A01806","ANALISTA ADMINISTRATIVO","P",2,100,70,3,20190101,999999,0,858.33,0,35,35,0,20191231]
[null,"1","A01806","ANALISTA ADMINISTRATIVO","P",2,100,70,3,20190101,999999,0,911.24,0,35,35,0,20191231]
[null,"1","A01806","ANALISTA ADMINISTRATIVO","P",2,100,70,3,20190101,999999,0,964.16,0,35,35,0,20191231]
[null,"1","A01806","ANALISTA ADMINISTRATIVO","P",2,100,70,3,20190101,999999,0,992.08,0,35,35,0,20191231]
[null,"1","A01806","ANALISTA ADMINISTRATIVO","P",2,100,70,3,20190101,999999,0,1044.99,0,35,35,0,20191231]
[null,"1","A01806","ANALISTA ADMINISTRATIVO","P",2,100,70,3,20190101,999999,0,1097.9100000000001,0,35,35,0,20191231]
[null,"1","A01806","ANALISTA ADMINISTRATIVO","P",2,100,70,3,20190101,999999,0,11100.83,0,35,35,0,20191231]
[null,"1","A01806","ANALISTA ADMINISTRATIVO","P",2,100,70,3,20190101,999999,0,1203.74,0,35,35,0,20191231]
[null,"1","A01806","ANALISTA ADMINISTRATIVO","P",2,100,70,3,20190101,999999,0,1256.6600000000001,0,35,35,0,20191231]
[null,"1","A01806","ANALISTA ADMINISTRATIVO","P",2,4,70,3,20190101,999999,0,200,0,35,35,0,20191231]
[null,"1","A01806","ANALISTA ADMINISTRATIVO","P",2,4,70,3,20190101,999999,0,225,0,35,35,0,20191231]
[null,"1","A01806","ANALISTA ADMINISTRATIVO","P",2,4,70,3,20190101,999999,0,125,0,35,35,0,20191231]
[null,"1","A01806","ANALISTA ADMINISTRATIVO","P",2,4,70,3,20190101,999999,0,175,0,35,35,0,20191231]
[null,"1","A01806","ANALISTA ADMINISTRATIVO","P",2,4,70,3,20190101,999999,0,225,0,35,35,0,20191231]
[null,"1","A01806","ANALISTA ADMINISTRATIVO","P",2,20,70,3,20190101,999999,0,1200,0,35,35,0,20191231]
[null,"1","A01806","ANALISTA ADMINISTRATIVO","P",2,20,70,3,20190101,999999,0,1200,0,35,35,0,20191231]
[null,"1","A01806","ANALISTA ADMINISTRATIVO","P",2,11,70,3,20190101,999999,0,565,0,35,35,0,20191231]
[null,"1","A01806","ANALISTA ADMINISTRATIVO","P",2,11,70,3,20190101,999999,0,565,0,35,35,0,20191231]
[null,"1","A01807","ANALISTA ADMINISTRATIVO","P",2,6,70,3,20190101,999999,0,7587.2,0,35,35,0,20191231]
[null,"1","A01808","ANALISTA ADMINISTRATIVO","P",2,5,70,3,20190101,999999,0,1707.12,0,35,35,0,20191231]
[null,"1","A01809","ANALISTA ADMINISTRATIVO","P",2,7,70,3,20190101,999999,0,1832.6,0,35,35,0,20191231]
[null,"1","A01810","ANALISTA ADMINISTRATIVO","P",2,31,70,3,20190101,999999,0,2199.12,0,35,35,0,20191231]
[null,"1","A01811","ANALISTA ADMINISTRATIVO","P",2,46,70,3,20190101,999999,0,733.04,0,35,35,0,20191231]
[null,"1","A01812","ANALISTA ADMINISTRATIVO","P",2,421,70,3,20190101,999999,0,916.3,0,35,35,0,20191231]
[null,"1","A01807","JEFE DE OFICINA","P",2,1,81,5,20190101,999999,0,6597.4,0,35,35,0,20191231]
[null,"1","A01807","JEFE DE OFICINA","P",2,9,81,5,20190101,999999,0,565,0,35,35,0,20191231]
[null,"1","A01807","JEFE DE OFICINA","P",2,9,81,5,20190101,999999,0,565,0,35,35,0,20191231]
[null,"1","A01807","JEFE DE OFICINA","P",2,12,81,5,20190101,999999,0,565,0,35,35,0,20191231]
[null,"1","A01807","JEFE DE OFICINA","P",2,12,81,5,20190101,999999,0,565,0,35,35,0,20191231]
[null,"1","A01807","JEFE DE OFICINA","P",2,63,81,5,20190101,999999,0,666.76,0,35,35,0,20191231]
[null,"1","A01807","JEFE DE OFICINA","P",2,74,81,5,20190101,999999,0,743.44,0,35,35,0,20191231]
[null,"1","A01807","JEFE DE OFICINA","P",2,15,81,5,20190101,999999,0,200.03,0,35,35,0,20191231]
[null,"1","A01807","JEFE DE OFICINA","P",2,13,81,5,20190101,999999,0,60,0,35,35,0,20191231]
[null,"1","A01807","JEFE DE OFICINA","P",2,13,81,5,20190101,999999,0,80,0,35,35,0,20191231]
[null,"1","A01807","JEFE DE OFICINA","P",2,30,81,5,20190101,999999,0,291.42,0,35,35,0,20191231]
[null,"1","A01807","JEFE DE OFICINA","P",2,21,81,5,20190101,999999,0,2000,0,35,35,0,20191231]
[null,"1","A01807","JEFE DE OFICINA","P",2,100,81,5,20190101,999999,0,67.41,0,35,35,0,20191231]
[null,"1","A01807","JEFE DE OFICINA","P",2,100,81,5,20190101,999999,0,123.21,0,35,35,0,20191231]
[null,"1","A01807","JEFE DE OFICINA","P",2,100,81,5,20190101,999999,0,179.01,0,35,35,0,20191231]
[null,"1","A01807","JEFE DE OFICINA","P",2,100,81,5,20190101,999999,0,234.81,0,35,35,0,20191231]
[null,"1","A01807","JEFE DE OFICINA","P",2,100,81,5,20190101,999999,0,290.62,0,35,35,0,20191231]
[null,"1","A01807","JEFE DE OFICINA","P",2,100,81,5,20190101,999999,0,321.42,0,35,35,0,20191231]
[null,"1","A01807","JEFE DE OFICINA","P",2,100,81,5,20190101,999999,0,377.22,0,35,35,0,20191231]
[null,"1","A01807","JEFE DE OFICINA","P",2,100,81,5,20190101,999999,0,433.02,0,35,35,0,20191231]
[null,"1","A01807","JEFE DE OFICINA","P",2,100,81,5,20190101,999999,0,488.82,0,35,35,0,20191231]
[null,"1","A01807","JEFE DE OFICINA","P",2,100,81,5,20190101,999999,0,544.63,0,35,35,0,20191231]
[null,"1","A01807","JEFE DE OFICINA","P",2,100,81,5,20190101,999999,0,5100.43,0,35,35,0,20191231]
[null,"1","A01807","JEFE DE OFICINA","P",2,100,81,5,20190101,999999,0,606.23,0,35,35,0,20191231]
[null,"1","A01807","JEFE DE OFICINA","P",2,100,81,5,20190101,999999,0,662.03,0,35,35,0,20191231]
[null,"1","A01807","JEFE DE OFICINA","P",2,100,81,5,20190101,999999,0,717.84,0,35,35,0,20191231]
[null,"1","A01807","JEFE DE OFICINA","P",2,100,81,5,20190101,999999,0,773.64,0,35,35,0,20191231]
[null,"1","A01807","JEFE DE OFICINA","P",2,100,81,5,20190101,999999,0,804.44,0,35,35,0,20191231]
[null,"1","A01807","JEFE DE OFICINA","P",2,100,81,5,20190101,999999,0,860.24,0,35,35,0,20191231]
[null,"1","A01807","JEFE DE OFICINA","P",2,100,81,5,20190101,999999,0,916.04,0,35,35,0,20191231]
[null,"1","A01807","JEFE DE OFICINA","P",2,100,81,5,20190101,999999,0,971.85,0,35,35,0,20191231]
[null,"1","A01807","JEFE DE OFICINA","P",2,100,81,5,20190101,999999,0,1027.6500000000001,0,35,35,0,20191231]
[null,"1","A01807","JEFE DE OFICINA","P",2,100,81,5,20190101,999999,0,1058.45,0,35,35,0,20191231]
[null,"1","A01807","JEFE DE OFICINA","P",2,100,81,5,20190101,999999,0,1114.25,0,35,35,0,20191231]
[null,"1","A01807","JEFE DE OFICINA","P",2,100,81,5,20190101,999999,0,1170.06,0,35,35,0,20191231]
[null,"1","A01807","JEFE DE OFICINA","P",2,100,81,5,20190101,999999,0,1125.8599999999999,0,35,35,0,20191231]
[null,"1","A01807","JEFE DE OFICINA","P",2,100,81,5,20190101,999999,0,1281.6600000000001,0,35,35,0,20191231]
[null,"1","A01807","JEFE DE OFICINA","P",2,100,81,5,20190101,999999,0,1337.46,0,35,35,0,20191231]
[null,"1","A01807","JEFE DE OFICINA","P",2,4,81,5,20190101,999999,0,200,0,35,35,0,20191231]
[null,"1","A01807","JEFE DE OFICINA","P",2,4,81,5,20190101,999999,0,225,0,35,35,0,20191231]
[null,"1","A01807","JEFE DE OFICINA","P",2,4,81,5,20190101,999999,0,125,0,35,35,0,20191231]
[null,"1","A01807","JEFE DE OFICINA","P",2,4,81,5,20190101,999999,0,175,0,35,35,0,20191231]
[null,"1","A01807","JEFE DE OFICINA","P",2,4,81,5,20190101,999999,0,100,0,35,35,0,20191231]
[null,"1","A01807","JEFE DE OFICINA","P",2,20,81,5,20190101,999999,0,1200,0,35,35,0,20191231]
[null,"1","A01807","JEFE DE OFICINA","P",2,20,81,5,20190101,999999,0,1200,0,35,35,0,20191231]
[null,"1","A01807","JEFE DE OFICINA","P",2,11,81,5,20190101,999999,0,565,0,35,35,0,20191231]
[null,"1","A01807","JEFE DE OFICINA","P",2,11,81,5,20190101,999999,0,565,0,35,35,0,20191231]
[null,"1","A01808","JEFE DE OFICINA","P",2,6,81,5,20190101,999999,0,8001.04,0,35,35,0,20191231]
[null,"1","A01809","JEFE DE OFICINA","P",2,5,81,5,20190101,999999,0,1800.23,0,35,35,0,20191231]
[null,"1","A01810","JEFE DE OFICINA","P",2,7,81,5,20190101,999999,0,1932.6,0,35,35,0,20191231]
[null,"1","A01811","JEFE DE OFICINA","P",2,31,81,5,20190101,999999,0,2319.12,0,35,35,0,20191231]
[null,"1","A01812","JEFE DE OFICINA","P",2,46,81,5,20190101,999999,0,773.04,0,35,35,0,20191231]
[null,"1","A01813","JEFE DE OFICINA","P",2,421,81,5,20190101,999999,0,966.3,0,35,35,0,20191231]
[null,"1","T03820","TECNICO DOCENTE","P",2,1,82,7,20190101,999999,0,6824.9,0,35,35,0,20191231]
[null,"1","T03820","TECNICO DOCENTE","P",2,3,82,7,20190101,999999,0,1105.05,0,35,35,0,20191231]
[null,"1","T03820","TECNICO DOCENTE","P",2,3,82,7,20190101,999999,0,1148.1600000000001,0,35,35,0,20191231]
[null,"1","T03820","TECNICO DOCENTE","P",2,9,82,7,20190101,999999,0,565,0,35,35,0,20191231]
[null,"1","T03820","TECNICO DOCENTE","P",2,9,82,7,20190101,999999,0,565,0,35,35,0,20191231]
[null,"1","T03820","TECNICO DOCENTE","P",2,12,82,7,20190101,999999,0,565,0,35,35,0,20191231]
[null,"1","T03820","TECNICO DOCENTE","P",2,12,82,7,20190101,999999,0,565,0,35,35,0,20191231]
[null,"1","T03820","TECNICO DOCENTE","P",2,63,82,7,20190101,999999,0,689.74,0,35,35,0,20191231]
[null,"1","T03820","TECNICO DOCENTE","P",2,74,82,7,20190101,999999,0,769.06,0,35,35,0,20191231]
[null,"1","T03820","TECNICO DOCENTE","P",2,13,82,7,20190101,999999,0,60,0,35,35,0,20191231]
[null,"1","T03820","TECNICO DOCENTE","P",2,13,82,7,20190101,999999,0,80,0,35,35,0,20191231]
[null,"1","T03820","TECNICO DOCENTE","P",2,30,82,7,20190101,999999,0,291.42,0,35,35,0,20191231]
[null,"1","T03820","TECNICO DOCENTE","P",2,21,82,7,20190101,999999,0,2000,0,35,35,0,20191231]
[null,"1","T03820","TECNICO DOCENTE","P",2,100,82,7,20190101,999999,0,73.180000000000007,0,35,35,0,20191231]
[null,"1","T03820","TECNICO DOCENTE","P",2,100,82,7,20190101,999999,0,130.91,0,35,35,0,20191231]
[null,"1","T03820","TECNICO DOCENTE","P",2,100,82,7,20190101,999999,0,188.63,0,35,35,0,20191231]
[null,"1","T03820","TECNICO DOCENTE","P",2,100,82,7,20190101,999999,0,246.36,0,35,35,0,20191231]
[null,"1","T03820","TECNICO DOCENTE","P",2,100,82,7,20190101,999999,0,304.08,0,35,35,0,20191231]
[null,"1","T03820","TECNICO DOCENTE","P",2,100,82,7,20190101,999999,0,336.81,0,35,35,0,20191231]
[null,"1","T03820","TECNICO DOCENTE","P",2,100,82,7,20190101,999999,0,394.54,0,35,35,0,20191231]
[null,"1","T03820","TECNICO DOCENTE","P",2,100,82,7,20190101,999999,0,452.26,0,35,35,0,20191231]
[null,"1","T03820","TECNICO DOCENTE","P",2,100,82,7,20190101,999999,0,1009.99,0,35,35,0,20191231]
[null,"1","T03820","TECNICO DOCENTE","P",2,100,82,7,20190101,999999,0,567.72,0,35,35,0,20191231]
[null,"1","T03820","TECNICO DOCENTE","P",2,100,82,7,20190101,999999,0,575.44000000000005,0,35,35,0,20191231]
[null,"1","T03820","TECNICO DOCENTE","P",2,100,82,7,20190101,999999,0,633.16999999999996,0,35,35,0,20191231]
[null,"1","T03820","TECNICO DOCENTE","P",2,100,82,7,20190101,999999,0,690.89,0,35,35,0,20191231]
[null,"1","T03820","TECNICO DOCENTE","P",2,100,82,7,20190101,999999,0,748.62,0,35,35,0,20191231]
[null,"1","T03820","TECNICO DOCENTE","P",2,100,82,7,20190101,999999,0,806.35,0,35,35,0,20191231]
[null,"1","T03820","TECNICO DOCENTE","P",2,100,82,7,20190101,999999,0,839.07,0,35,35,0,20191231]
[null,"1","T03820","TECNICO DOCENTE","P",2,100,82,7,20190101,999999,0,896.8,0,35,35,0,20191231]
[null,"1","T03820","TECNICO DOCENTE","P",2,100,82,7,20190101,999999,0,954.53,0,35,35,0,20191231]
[null,"1","T03820","TECNICO DOCENTE","P",2,100,82,7,20190101,999999,0,1012.25,0,35,35,0,20191231]
[null,"1","T03820","TECNICO DOCENTE","P",2,100,82,7,20190101,999999,0,1069.98,0,35,35,0,20191231]
[null,"1","T03820","TECNICO DOCENTE","P",2,100,82,7,20190101,999999,0,1102.7,0,35,35,0,20191231]
[null,"1","T03820","TECNICO DOCENTE","P",2,100,82,7,20190101,999999,0,1160.43,0,35,35,0,20191231]
[null,"1","T03820","TECNICO DOCENTE","P",2,100,82,7,20190101,999999,0,1218.1600000000001,0,35,35,0,20191231]
[null,"1","T03820","TECNICO DOCENTE","P",2,100,82,7,20190101,999999,0,1333.61,0,35,35,0,20191231]
[null,"1","T03820","TECNICO DOCENTE","P",2,100,82,7,20190101,999999,0,1391.34,0,35,35,0,20191231]
[null,"1","T03820","TECNICO DOCENTE","P",2,4,82,7,20190101,999999,0,200,0,35,35,0,20191231]
[null,"1","T03820","TECNICO DOCENTE","P",2,4,82,7,20190101,999999,0,225,0,35,35,0,20191231]
[null,"1","T03820","TECNICO DOCENTE","P",2,4,82,7,20190101,999999,0,125,0,35,35,0,20191231]
[null,"1","T03820","TECNICO DOCENTE","P",2,4,82,7,20190101,999999,0,175,0,35,35,0,20191231]
[null,"1","T03820","TECNICO DOCENTE","P",2,4,82,7,20190101,999999,0,100,0,35,35,0,20191231]
[null,"1","T03820","TECNICO DOCENTE","P",2,20,82,7,20190101,999999,0,1200,0,35,35,0,20191231]
[null,"1","T03820","TECNICO DOCENTE","P",2,20,82,7,20190101,999999,0,1200,0,35,35,0,20191231]
[null,"1","T03820","TECNICO DOCENTE","P",2,11,82,7,20190101,999999,0,565,0,35,35,0,20191231]
[null,"1","T03820","TECNICO DOCENTE","P",2,11,82,7,20190101,999999,0,565,0,35,35,0,20191231]
[null,"1","T03821","TECNICO DOCENTE","P",2,6,82,7,20190101,999999,0,8276.7999999999993,0,35,35,0,20191231]
[null,"1","T03821","TECNICO DOCENTE","P",2,206,82,7,20190101,999999,0,0,0,35,35,0,20191231]
[null,"1","T03822","TECNICO DOCENTE","P",2,5,82,7,20190101,999999,0,1862.28,0,35,35,0,20191231]
[null,"1","T03823","TECNICO DOCENTE","P",2,7,82,7,20190101,999999,0,1999.3,0,35,35,0,20191231]
[null,"1","T03824","TECNICO DOCENTE","P",2,31,82,7,20190101,999999,0,2399.16,0,35,35,0,20191231]
[null,"1","T03825","TECNICO DOCENTE","P",2,46,82,7,20190101,999999,0,799.72,0,35,35,0,20191231]
[null,"1","T03826","TECNICO DOCENTE","P",2,421,82,7,20190101,999999,0,999.65,0,35,35,0,20191231]
[null,"1","T03823","TECNICO SUPERIOR","P",2,1,85,7,20190101,999999,0,6824.9,0,35,35,0,20191231]
[null,"1","T03823","TECNICO SUPERIOR","P",2,3,85,7,20190101,999999,0,1148.1600000000001,0,35,35,0,20191231]
[null,"1","T03823","TECNICO SUPERIOR","P",2,3,85,7,20190101,999999,0,0,0,35,35,0,20191231]
[null,"1","T03823","TECNICO SUPERIOR","P",2,9,85,7,20190101,999999,0,565,0,35,35,0,20191231]
[null,"1","T03823","TECNICO SUPERIOR","P",2,9,85,7,20190101,999999,0,565,0,35,35,0,20191231]
[null,"1","T03823","TECNICO SUPERIOR","P",2,12,85,7,20190101,999999,0,565,0,35,35,0,20191231]
[null,"1","T03823","TECNICO SUPERIOR","P",2,12,85,7,20190101,999999,0,565,0,35,35,0,20191231]
[null,"1","T03823","TECNICO SUPERIOR","P",2,63,85,7,20190101,999999,0,689.74,0,35,35,0,20191231]
[null,"1","T03823","TECNICO SUPERIOR","P",2,74,85,7,20190101,999999,0,769.06,0,35,35,0,20191231]
[null,"1","T03823","TECNICO SUPERIOR","P",2,15,85,7,20190101,999999,0,199.93,0,35,35,0,20191231]
[null,"1","T03823","TECNICO SUPERIOR","P",2,13,85,7,20190101,999999,0,60,0,35,35,0,20191231]
[null,"1","T03823","TECNICO SUPERIOR","P",2,13,85,7,20190101,999999,0,80,0,35,35,0,20191231]
[null,"1","T03823","TECNICO SUPERIOR","P",2,30,85,7,20190101,999999,0,291.42,0,35,35,0,20191231]
[null,"1","T03823","TECNICO SUPERIOR","P",2,21,85,7,20190101,999999,0,2000,0,35,35,0,20191231]
[null,"1","T03823","TECNICO SUPERIOR","P",2,100,85,7,20190101,999999,0,73.180000000000007,0,35,35,0,20191231]
[null,"1","T03823","TECNICO SUPERIOR","P",2,100,85,7,20190101,999999,0,130.91,0,35,35,0,20191231]
[null,"1","T03823","TECNICO SUPERIOR","P",2,100,85,7,20190101,999999,0,188.63,0,35,35,0,20191231]
[null,"1","T03823","TECNICO SUPERIOR","P",2,100,85,7,20190101,999999,0,246.36,0,35,35,0,20191231]
[null,"1","T03823","TECNICO SUPERIOR","P",2,100,85,7,20190101,999999,0,304.08,0,35,35,0,20191231]
[null,"1","T03823","TECNICO SUPERIOR","P",2,100,85,7,20190101,999999,0,336.81,0,35,35,0,20191231]
[null,"1","T03823","TECNICO SUPERIOR","P",2,100,85,7,20190101,999999,0,394.54,0,35,35,0,20191231]
[null,"1","T03823","TECNICO SUPERIOR","P",2,100,85,7,20190101,999999,0,452.26,0,35,35,0,20191231]
[null,"1","T03823","TECNICO SUPERIOR","P",2,100,85,7,20190101,999999,0,1009.99,0,35,35,0,20191231]
[null,"1","T03823","TECNICO SUPERIOR","P",2,100,85,7,20190101,999999,0,567.72,0,35,35,0,20191231]
[null,"1","T03823","TECNICO SUPERIOR","P",2,100,85,7,20190101,999999,0,575.44000000000005,0,35,35,0,20191231]
[null,"1","T03823","TECNICO SUPERIOR","P",2,100,85,7,20190101,999999,0,633.16999999999996,0,35,35,0,20191231]
[null,"1","T03823","TECNICO SUPERIOR","P",2,100,85,7,20190101,999999,0,690.89,0,35,35,0,20191231]
[null,"1","T03823","TECNICO SUPERIOR","P",2,100,85,7,20190101,999999,0,748.62,0,35,35,0,20191231]
[null,"1","T03823","TECNICO SUPERIOR","P",2,100,85,7,20190101,999999,0,806.35,0,35,35,0,20191231]
[null,"1","T03823","TECNICO SUPERIOR","P",2,100,85,7,20190101,999999,0,839.07,0,35,35,0,20191231]
[null,"1","T03823","TECNICO SUPERIOR","P",2,100,85,7,20190101,999999,0,896.8,0,35,35,0,20191231]
[null,"1","T03823","TECNICO SUPERIOR","P",2,100,85,7,20190101,999999,0,954.53,0,35,35,0,20191231]
[null,"1","T03823","TECNICO SUPERIOR","P",2,100,85,7,20190101,999999,0,1012.25,0,35,35,0,20191231]
[null,"1","T03823","TECNICO SUPERIOR","P",2,100,85,7,20190101,999999,0,1069.98,0,35,35,0,20191231]
[null,"1","T03823","TECNICO SUPERIOR","P",2,100,85,7,20190101,999999,0,1102.7,0,35,35,0,20191231]
[null,"1","T03823","TECNICO SUPERIOR","P",2,100,85,7,20190101,999999,0,1160.43,0,35,35,0,20191231]
[null,"1","T03823","TECNICO SUPERIOR","P",2,100,85,7,20190101,999999,0,1218.1600000000001,0,35,35,0,20191231]
[null,"1","T03823","TECNICO SUPERIOR","P",2,100,85,7,20190101,999999,0,1275.8800000000001,0,35,35,0,20191231]
[null,"1","T03823","TECNICO SUPERIOR","P",2,100,85,7,20190101,999999,0,1333.61,0,35,35,0,20191231]
[null,"1","T03823","TECNICO SUPERIOR","P",2,100,85,7,20190101,999999,0,1391.34,0,35,35,0,20191231]
[null,"1","T03823","TECNICO SUPERIOR","P",2,4,85,7,20190101,999999,0,225,0,35,35,0,20191231]
[null,"1","T03823","TECNICO SUPERIOR","P",2,4,85,7,20190101,999999,0,200,0,35,35,0,20191231]
[null,"1","T03823","TECNICO SUPERIOR","P",2,4,85,7,20190101,999999,0,175,0,35,35,0,20191231]
[null,"1","T03823","TECNICO SUPERIOR","P",2,4,85,7,20190101,999999,0,125,0,35,35,0,20191231]
[null,"1","T03823","TECNICO SUPERIOR","P",2,4,85,7,20190101,999999,0,100,0,35,35,0,20191231]
[null,"1","T03823","TECNICO SUPERIOR","P",2,20,85,7,20190101,999999,0,1200,0,35,35,0,20191231]
[null,"1","T03823","TECNICO SUPERIOR","P",2,20,85,7,20190101,999999,0,1200,0,35,35,0,20191231]
[null,"1","T03823","TECNICO SUPERIOR","P",2,11,85,7,20190101,999999,0,565,0,35,35,0,20191231]
[null,"1","T03823","TECNICO SUPERIOR","P",2,11,85,7,20190101,999999,0,565,0,35,35,0,20191231]
[null,"1","T03824","TECNICO SUPERIOR","P",2,6,85,7,20190101,999999,0,8276.7999999999993,0,35,35,0,20191231]
[null,"1","T03825","TECNICO SUPERIOR","P",2,206,85,7,20190101,999999,0,1862.28,0,35,35,0,20191231]
[null,"1","T03826","TECNICO SUPERIOR","P",2,5,85,7,20190101,999999,0,1799.37,0,35,35,0,20191231]
[null,"1","T03827","TECNICO SUPERIOR","P",2,7,85,7,20190101,999999,0,1999.3,0,35,35,0,20191231]
[null,"1","T03828","TECNICO SUPERIOR","P",2,31,85,7,20190101,999999,0,2399.16,0,35,35,0,20191231]
[null,"1","T03829","TECNICO SUPERIOR","P",2,46,85,7,20190101,999999,0,799.72,0,35,35,0,20191231]
[null,"1","T03830","TECNICO SUPERIOR","P",2,421,85,7,20190101,999999,0,999.65,0,35,35,0,20191231]
[null,"1","CF34810","ANALISTA ADMINISTRATIVO","P",2,1,70,3,20190101,999999,0,6743.65,0,35,35,0,20191231]
[null,"1","CF34810","ANALISTA ADMINISTRATIVO","P",2,1,70,3,20190101,999999,0,5498,0,35,35,0,20191231]
[null,"1","CF34810","ANALISTA ADMINISTRATIVO","P",2,9,70,3,20190101,999999,0,565,0,35,35,0,20191231]
[null,"1","CF34810","ANALISTA ADMINISTRATIVO","P",2,9,70,3,20190101,999999,0,565,0,35,35,0,20191231]
[null,"1","CF34810","ANALISTA ADMINISTRATIVO","P",2,12,70,3,20190101,999999,0,230,0,35,35,0,20191231]
[null,"1","CF34810","ANALISTA ADMINISTRATIVO","P",2,12,70,3,20190101,999999,0,565,0,35,35,0,20191231]
[null,"1","CF34810","ANALISTA ADMINISTRATIVO","P",2,20,70,3,20190101,999999,0,2000,0,35,35,0,20191231]
[null,"1","CF34810","ANALISTA ADMINISTRATIVO","P",2,20,70,3,20190101,999999,0,1200,0,35,35,0,20191231]
[null,"1","CF34810","ANALISTA ADMINISTRATIVO","P",2,11,70,3,20190101,999999,0,225,0,35,35,0,20191231]
[null,"1","CF34810","ANALISTA ADMINISTRATIVO","P",2,11,70,3,20190101,999999,0,565,0,35,35,0,20191231]
[null,"1","CF34811","ANALISTA ADMINISTRATIVO","P",2,6,70,3,20190101,999999,0,7330.4,0,35,35,0,20191231]
[null,"1","CF34812","ANALISTA ADMINISTRATIVO","P",2,5,70,3,20190101,999999,0,916.35,0,35,35,0,20191231]
[null,"1","CF04807","SECRETARIA EJECUTIVA B","P",2,1,61,6,20190101,999999,0,6510.6,0,35,35,0,20191231]
[null,"1","CF04807","SECRETARIA EJECUTIVA B","P",2,1,61,6,20190101,999999,0,5897.85,0,35,35,0,20191231]
[null,"1","CF04807","SECRETARIA EJECUTIVA B","P",2,3,61,6,20190101,999999,0,457.35,0,35,35,0,20191231]
[null,"1","CF04807","SECRETARIA EJECUTIVA B","P",2,3,61,6,20190101,999999,0,475.2,0,35,35,0,20191231]
[null,"1","CF04807","SECRETARIA EJECUTIVA B","P",2,9,61,6,20190101,999999,0,225,0,35,35,0,20191231]
[null,"1","CF04807","SECRETARIA EJECUTIVA B","P",2,9,61,6,20190101,999999,0,565,0,35,35,0,20191231]
[null,"1","CF04807","SECRETARIA EJECUTIVA B","P",2,12,61,6,20190101,999999,0,230,0,35,35,0,20191231]
[null,"1","CF04807","SECRETARIA EJECUTIVA B","P",2,12,61,6,20190101,999999,0,565,0,35,35,0,20191231]
[null,"1","CF04807","SECRETARIA EJECUTIVA B","P",2,20,61,6,20190101,999999,0,2000,0,35,35,0,20191231]
[null,"1","CF04807","SECRETARIA EJECUTIVA B","P",2,20,61,6,20190101,999999,0,1200,0,35,35,0,20191231]
[null,"1","CF04807","SECRETARIA EJECUTIVA B","P",2,11,61,6,20190101,999999,0,225,0,35,35,0,20191231]
[null,"1","CF04807","SECRETARIA EJECUTIVA B","P",2,11,61,6,20190101,999999,0,565,0,35,35,0,20191231]
[null,"1","CF04808","SECRETARIA EJECUTIVA B","P",2,6,61,6,20190101,999999,0,7864,0,35,35,0,20191231]
[null,"1","CF04809","SECRETARIA EJECUTIVA B","P",2,5,61,6,20190101,999999,0,983,0,35,35,0,20191231]
[null,"1","CF04810","SECRETARIA EJECUTIVA B","P",2,206,61,6,20190101,999999,0,633.6,0,35,35,0,20191231]
[null,"1","CF33849","COORDINADOR DE UNIDAD DE SERVICIOS ESPECIALIZADOS","P",2,1,88,8,20190101,999999,0,6699.64,0,35,35,0,20191231]
[null,"1","CF33849","COORDINADOR DE UNIDAD DE SERVICIOS ESPECIALIZADOS","P",2,1,88,8,20190101,999999,0,6069.1,0,35,35,0,20191231]
[null,"1","CF33849","COORDINADOR DE UNIDAD DE SERVICIOS ESPECIALIZADOS","P",2,3,88,8,20190101,999999,0,1562.3,0,35,35,0,20191231]
[null,"1","CF33849","COORDINADOR DE UNIDAD DE SERVICIOS ESPECIALIZADOS","P",2,3,88,8,20190101,999999,0,1623.25,0,35,35,0,20191231]
[null,"1","CF33849","COORDINADOR DE UNIDAD DE SERVICIOS ESPECIALIZADOS","P",2,9,88,8,20190101,999999,0,225,0,35,35,0,20191231]
[null,"1","CF33849","COORDINADOR DE UNIDAD DE SERVICIOS ESPECIALIZADOS","P",2,9,88,8,20190101,999999,0,565,0,35,35,0,20191231]
[null,"1","CF33849","COORDINADOR DE UNIDAD DE SERVICIOS ESPECIALIZADOS","P",2,12,88,8,20190101,999999,0,230,0,35,35,0,20191231]
[null,"1","CF33849","COORDINADOR DE UNIDAD DE SERVICIOS ESPECIALIZADOS","P",2,12,88,8,20190101,999999,0,565,0,35,35,0,20191231]
[null,"1","CF33849","COORDINADOR DE UNIDAD DE SERVICIOS ESPECIALIZADOS","P",2,20,88,8,20190101,999999,0,2000,0,35,35,0,20191231]
[null,"1","CF33849","COORDINADOR DE UNIDAD DE SERVICIOS ESPECIALIZADOS","P",2,20,88,8,20190101,999999,0,1200,0,35,35,0,20191231]
[null,"1","CF33849","COORDINADOR DE UNIDAD DE SERVICIOS ESPECIALIZADOS","P",2,11,88,8,20190101,999999,0,225,0,35,35,0,20191231]
[null,"1","CF33849","COORDINADOR DE UNIDAD DE SERVICIOS ESPECIALIZADOS","P",2,11,88,8,20190101,999999,0,565,0,35,35,0,20191231]
[null,"1","CF338100","COORDINADOR DE UNIDAD DE SERVICIOS ESPECIALIZADOS","P",2,6,88,8,20190101,999999,0,8092,0,35,35,0,20191231]
[null,"1","CF33851","COORDINADOR DE UNIDAD DE SERVICIOS ESPECIALIZADOS","P",2,5,88,8,20190101,999999,0,1011.5,0,35,35,0,20191231]
[null,"1","CF33852","COORDINADOR DE UNIDAD DE SERVICIOS ESPECIALIZADOS","P",2,206,88,8,20190101,999999,0,2164.4,0,35,35,0,20191231]
[null,"1","T03810","ESPECIALISTA EN PROYECTOS TECNICOS","P",2,1,59,2,20190101,999999,0,0,6743.65,35,35,0,20191231]
[null,"1","T03810","ESPECIALISTA EN PROYECTOS TECNICOS","P",2,9,59,2,20190101,999999,0,0,225,35,35,0,20191231]
[null,"1","T03810","ESPECIALISTA EN PROYECTOS TECNICOS","P",2,9,59,2,20190101,999999,0,0,565,35,35,0,20191231]
[null,"1","T03810","ESPECIALISTA EN PROYECTOS TECNICOS","P",2,12,59,2,20190101,999999,0,0,230,35,35,0,20191231]
[null,"1","T03810","ESPECIALISTA EN PROYECTOS TECNICOS","P",2,12,59,2,20190101,999999,0,0,565,35,35,0,20191231]
[null,"1","T03810","ESPECIALISTA EN PROYECTOS TECNICOS","P",2,63,59,2,20190101,999999,0,0,681.54,35,35,0,20191231]
[null,"1","T03810","ESPECIALISTA EN PROYECTOS TECNICOS","P",2,74,59,2,20190101,999999,0,0,759.92,35,35,0,20191231]
[null,"1","T03810","ESPECIALISTA EN PROYECTOS TECNICOS","P",2,15,59,2,20190101,999999,0,0,197.55,35,35,0,20191231]
[null,"1","T03810","ESPECIALISTA EN PROYECTOS TECNICOS","P",2,13,59,2,20190101,999999,0,0,60,35,35,0,20191231]
[null,"1","T03810","ESPECIALISTA EN PROYECTOS TECNICOS","P",2,13,59,2,20190101,999999,0,0,80,35,35,0,20191231]
[null,"1","T03810","ESPECIALISTA EN PROYECTOS TECNICOS","P",2,30,59,2,20190101,999999,0,0,291.42,35,35,0,20191231]
[null,"1","T03810","ESPECIALISTA EN PROYECTOS TECNICOS","P",2,21,59,2,20190101,999999,0,0,2000,35,35,0,20191231]
[null,"1","T03810","ESPECIALISTA EN PROYECTOS TECNICOS","P",2,100,59,2,20190101,999999,0,0,1054.8699999999999,35,35,0,20191231]
[null,"1","T03810","ESPECIALISTA EN PROYECTOS TECNICOS","P",2,100,59,2,20190101,999999,0,0,1372.11,35,35,0,20191231]
[null,"1","T03810","ESPECIALISTA EN PROYECTOS TECNICOS","P",2,4,59,2,20190101,999999,0,0,225,35,35,0,20191231]
[null,"1","T03810","ESPECIALISTA EN PROYECTOS TECNICOS","P",2,4,59,2,20190101,999999,0,0,200,35,35,0,20191231]
[null,"1","T03810","ESPECIALISTA EN PROYECTOS TECNICOS","P",2,20,59,2,20190101,999999,0,0,2000,35,35,0,20191231]
[null,"1","T03810","ESPECIALISTA EN PROYECTOS TECNICOS","P",2,20,59,2,20190101,999999,0,0,1200,35,35,0,20191231]
[null,"1","T03810","ESPECIALISTA EN PROYECTOS TECNICOS","P",2,11,59,2,20190101,999999,0,0,565,35,35,0,20191231]
[null,"1","T03810","ESPECIALISTA EN PROYECTOS TECNICOS","P",2,11,59,2,20190101,999999,0,0,565,35,35,0,20191231]
[null,"1","T03811","ESPECIALISTA EN PROYECTOS TECNICOS","P",2,6,59,2,20190101,999999,0,0,7902,35,35,0,20191231]
[null,"1","T03812","ESPECIALISTA EN PROYECTOS TECNICOS","P",2,5,59,2,20190101,999999,0,0,1777.95,35,35,0,20191231]
[null,"1","T03813","ESPECIALISTA EN PROYECTOS TECNICOS","P",2,7,59,2,20190101,999999,0,0,1975.5,35,35,0,20191231]
[null,"1","T03814","ESPECIALISTA EN PROYECTOS TECNICOS","P",2,31,59,2,20190101,999999,0,0,2370.6,35,35,0,20191231]
[null,"1","T03815","ESPECIALISTA EN PROYECTOS TECNICOS","P",2,46,59,2,20190101,999999,0,0,790.2,35,35,0,20191231]
[null,"1","T03816","ESPECIALISTA EN PROYECTOS TECNICOS","P",2,421,59,2,20190101,999999,0,0,987.75,35,35,0,20191231]
[null,"1","A01806","ANALISTA ADMINISTRATIVO","P",2,1,70,3,20190101,999999,0,0,6743.65,35,35,0,20191231]
[null,"1","A01806","ANALISTA ADMINISTRATIVO","P",2,9,70,3,20190101,999999,0,0,225,35,35,0,20191231]
[null,"1","A01806","ANALISTA ADMINISTRATIVO","P",2,9,70,3,20190101,999999,0,0,565,35,35,0,20191231]
[null,"1","A01806","ANALISTA ADMINISTRATIVO","P",2,12,70,3,20190101,999999,0,0,230,35,35,0,20191231]
[null,"1","A01806","ANALISTA ADMINISTRATIVO","P",2,12,70,3,20190101,999999,0,0,565,35,35,0,20191231]
[null,"1","A01806","ANALISTA ADMINISTRATIVO","P",2,63,70,3,20190101,999999,0,0,697.96,35,35,0,20191231]
[null,"1","A01806","ANALISTA ADMINISTRATIVO","P",2,74,70,3,20190101,999999,0,0,778.22,35,35,0,20191231]
[null,"1","A01806","ANALISTA ADMINISTRATIVO","P",2,15,70,3,20190101,999999,0,0,202.31,35,35,0,20191231]
[null,"1","A01806","ANALISTA ADMINISTRATIVO","P",2,13,70,3,20190101,999999,0,0,60,35,35,0,20191231]
[null,"1","A01806","ANALISTA ADMINISTRATIVO","P",2,13,70,3,20190101,999999,0,0,80,35,35,0,20191231]
[null,"1","A01806","ANALISTA ADMINISTRATIVO","P",2,30,70,3,20190101,999999,0,0,291.42,35,35,0,20191231]
[null,"1","A01806","ANALISTA ADMINISTRATIVO","P",2,21,70,3,20190101,999999,0,0,2000,35,35,0,20191231]
[null,"1","A01806","ANALISTA ADMINISTRATIVO","P",2,100,70,3,20190101,999999,0,0,1085.0899999999999,35,35,0,20191231]
[null,"1","A01806","ANALISTA ADMINISTRATIVO","P",2,100,70,3,20190101,999999,0,0,1410.56,35,35,0,20191231]
[null,"1","A01806","ANALISTA ADMINISTRATIVO","P",2,4,70,3,20190101,999999,0,0,200,35,35,0,20191231]
[null,"1","A01806","ANALISTA ADMINISTRATIVO","P",2,4,70,3,20190101,999999,0,0,225,35,35,0,20191231]
[null,"1","A01806","ANALISTA ADMINISTRATIVO","P",2,20,70,3,20190101,999999,0,0,2000,35,35,0,20191231]
[null,"1","A01806","ANALISTA ADMINISTRATIVO","P",2,20,70,3,20190101,999999,0,0,1200,35,35,0,20191231]
[null,"1","A01806","ANALISTA ADMINISTRATIVO","P",2,11,70,3,20190101,999999,0,0,225,35,35,0,20191231]
[null,"1","A01806","ANALISTA ADMINISTRATIVO","P",2,11,70,3,20190101,999999,0,0,565,35,35,0,20191231]
[null,"1","A01807","ANALISTA ADMINISTRATIVO","P",2,6,70,3,20190101,999999,0,0,8092.4,35,35,0,20191231]
[null,"1","A01808","ANALISTA ADMINISTRATIVO","P",2,5,70,3,20190101,999999,0,0,1820.79,35,35,0,20191231]
[null,"1","A01809","ANALISTA ADMINISTRATIVO","P",2,7,70,3,20190101,999999,0,0,2023.1,35,35,0,20191231]
[null,"1","A01810","ANALISTA ADMINISTRATIVO","P",2,31,70,3,20190101,999999,0,0,2427.7199999999998,35,35,0,20191231]
[null,"1","A01811","ANALISTA ADMINISTRATIVO","P",2,46,70,3,20190101,999999,0,0,809.24,35,35,0,20191231]
[null,"1","A01812","ANALISTA ADMINISTRATIVO","P",2,421,70,3,20190101,999999,0,0,1011.55,35,35,0,20191231]
[null,"1","T03820","TECNICO DOCENTE","P",2,1,82,7,20190101,999999,0,0,7377.35,35,35,0,20191231]
[null,"1","T03820","TECNICO DOCENTE","P",2,3,82,7,20190101,999999,0,0,1379.1,35,35,0,20191231]
[null,"1","T03820","TECNICO DOCENTE","P",2,3,82,7,20190101,999999,0,0,1379.1,35,35,0,20191231]
[null,"1","T03820","TECNICO DOCENTE","P",2,9,82,7,20190101,999999,0,0,225,35,35,0,20191231]
[null,"1","T03820","TECNICO DOCENTE","P",2,9,82,7,20190101,999999,0,0,565,35,35,0,20191231]
[null,"1","T03820","TECNICO DOCENTE","P",2,12,82,7,20190101,999999,0,0,230,35,35,0,20191231]
[null,"1","T03820","TECNICO DOCENTE","P",2,12,82,7,20190101,999999,0,0,565,35,35,0,20191231]
[null,"1","T03820","TECNICO DOCENTE","P",2,63,82,7,20190101,999999,0,0,745.58,35,35,0,20191231]
[null,"1","T03820","TECNICO DOCENTE","P",2,74,82,7,20190101,999999,0,0,831.32,35,35,0,20191231]
[null,"1","T03820","TECNICO DOCENTE","P",2,13,82,7,20190101,999999,0,0,60,35,35,0,20191231]
[null,"1","T03820","TECNICO DOCENTE","P",2,13,82,7,20190101,999999,0,0,80,35,35,0,20191231]
[null,"1","T03820","TECNICO DOCENTE","P",2,30,82,7,20190101,999999,0,0,291.42,35,35,0,20191231]
[null,"1","T03820","TECNICO DOCENTE","P",2,21,82,7,20190101,999999,0,0,2000,35,35,0,20191231]
[null,"1","T03820","TECNICO DOCENTE","P",2,100,82,7,20190101,999999,0,0,87.2,35,35,0,20191231]
[null,"1","T03820","TECNICO DOCENTE","P",2,100,82,7,20190101,999999,0,0,149.6,35,35,0,20191231]
[null,"1","T03820","TECNICO DOCENTE","P",2,100,82,7,20190101,999999,0,0,212,35,35,0,20191231]
[null,"1","T03820","TECNICO DOCENTE","P",2,100,82,7,20190101,999999,0,0,274.39999999999998,35,35,0,20191231]
[null,"1","T03820","TECNICO DOCENTE","P",2,100,82,7,20190101,999999,0,0,336.8,35,35,0,20191231]
[null,"1","T03820","TECNICO DOCENTE","P",2,100,82,7,20190101,999999,0,0,374.2,35,35,0,20191231]
[null,"1","T03820","TECNICO DOCENTE","P",2,100,82,7,20190101,999999,0,0,436.6,35,35,0,20191231]
[null,"1","T03820","TECNICO DOCENTE","P",2,100,82,7,20190101,999999,0,0,499,35,35,0,20191231]
[null,"1","T03820","TECNICO DOCENTE","P",2,100,82,7,20190101,999999,0,0,561.4,35,35,0,20191231]
[null,"1","T03820","TECNICO DOCENTE","P",2,100,82,7,20190101,999999,0,0,623.79999999999995,35,35,0,20191231]
[null,"1","T03820","TECNICO DOCENTE","P",2,100,82,7,20190101,999999,0,0,636.19000000000005,35,35,0,20191231]
[null,"1","T03820","TECNICO DOCENTE","P",2,100,82,7,20190101,999999,0,0,698.59,35,35,0,20191231]
[null,"1","T03820","TECNICO DOCENTE","P",2,100,82,7,20190101,999999,0,0,760.99,35,35,0,20191231]
[null,"1","T03820","TECNICO DOCENTE","P",2,100,82,7,20190101,999999,0,0,823.39,35,35,0,20191231]
[null,"1","T03820","TECNICO DOCENTE","P",2,100,82,7,20190101,999999,0,0,885.79,35,35,0,20191231]
[null,"1","T03820","TECNICO DOCENTE","P",2,100,82,7,20190101,999999,0,0,923.19,35,35,0,20191231]
[null,"1","T03820","TECNICO DOCENTE","P",2,100,82,7,20190101,999999,0,0,985.59,35,35,0,20191231]
[null,"1","T03820","TECNICO DOCENTE","P",2,100,82,7,20190101,999999,0,0,1047.99,35,35,0,20191231]
[null,"1","T03820","TECNICO DOCENTE","P",2,100,82,7,20190101,999999,0,0,1110.3900000000001,35,35,0,20191231]
[null,"1","T03820","TECNICO DOCENTE","P",2,100,82,7,20190101,999999,0,0,1172.79,35,35,0,20191231]
[null,"1","T03820","TECNICO DOCENTE","P",2,100,82,7,20190101,999999,0,0,1210.19,35,35,0,20191231]
[null,"1","T03820","TECNICO DOCENTE","P",2,100,82,7,20190101,999999,0,0,1272.5899999999999,35,35,0,20191231]
[null,"1","T03820","TECNICO DOCENTE","P",2,100,82,7,20190101,999999,0,0,1334.99,35,35,0,20191231]
[null,"1","T03820","TECNICO DOCENTE","P",2,100,82,7,20190101,999999,0,0,1397.39,35,35,0,20191231]
[null,"1","T03820","TECNICO DOCENTE","P",2,100,82,7,20190101,999999,0,0,1459.79,35,35,0,20191231]
[null,"1","T03820","TECNICO DOCENTE","P",2,100,82,7,20190101,999999,0,0,1522.19,35,35,0,20191231]
[null,"1","T03820","TECNICO DOCENTE","P",2,4,82,7,20190101,999999,0,0,200,35,35,0,20191231]
[null,"1","T03820","TECNICO DOCENTE","P",2,4,82,7,20190101,999999,0,0,225,35,35,0,20191231]
[null,"1","T03820","TECNICO DOCENTE","P",2,4,82,7,20190101,999999,0,0,175,35,35,0,20191231]
[null,"1","T03820","TECNICO DOCENTE","P",2,4,82,7,20190101,999999,0,0,65.5,35,35,0,20191231]
[null,"1","T03820","TECNICO DOCENTE","P",2,4,82,7,20190101,999999,0,0,100,35,35,0,20191231]
[null,"1","T03820","TECNICO DOCENTE","P",2,20,82,7,20190101,999999,0,0,2000,35,35,0,20191231]
[null,"1","T03820","TECNICO DOCENTE","P",2,20,82,7,20190101,999999,0,0,1200,35,35,0,20191231]
[null,"1","T03820","TECNICO DOCENTE","P",2,11,82,7,20190101,999999,0,0,225,35,35,0,20191231]
[null,"1","T03820","TECNICO DOCENTE","P",2,11,82,7,20190101,999999,0,0,565,35,35,0,20191231]
[null,"1","T03821","TECNICO DOCENTE","P",2,6,82,7,20190101,999999,0,0,8644.4,35,35,0,20191231]
[null,"1","T03822","TECNICO DOCENTE","P",2,206,82,7,20190101,999999,0,0,1838.8,35,35,0,20191231]
[null,"1","T03823","TECNICO DOCENTE","P",2,5,82,7,20190101,999999,0,0,1944.99,35,35,0,20191231]
[null,"1","T03824","TECNICO DOCENTE","P",2,7,82,7,20190101,999999,0,0,2161.1,35,35,0,20191231]
[null,"1","T03825","TECNICO DOCENTE","P",2,31,82,7,20190101,999999,0,0,2593.3200000000002,35,35,0,20191231]
[null,"1","T03826","TECNICO DOCENTE","P",2,46,82,7,20190101,999999,0,0,864.44,35,35,0,20191231]
[null,"1","T03827","TECNICO DOCENTE","P",2,421,82,7,20190101,999999,0,0,1080.55,35,35,0,20191231]
[null,"1","T03823","TECNICO SUPERIOR","P",2,1,85,7,20190101,999999,0,0,7377.35,35,35,0,20191231]
[null,"1","T03823","TECNICO SUPERIOR","P",2,3,85,7,20190101,999999,0,0,1327.35,35,35,0,20191231]
[null,"1","T03823","TECNICO SUPERIOR","P",2,3,85,7,20190101,999999,0,0,1379.1,35,35,0,20191231]
[null,"1","T03823","TECNICO SUPERIOR","P",2,9,85,7,20190101,999999,0,0,225,35,35,0,20191231]
[null,"1","T03823","TECNICO SUPERIOR","P",2,9,85,7,20190101,999999,0,0,565,35,35,0,20191231]
[null,"1","T03823","TECNICO SUPERIOR","P",2,12,85,7,20190101,999999,0,0,230,35,35,0,20191231]
[null,"1","T03823","TECNICO SUPERIOR","P",2,12,85,7,20190101,999999,0,0,565,35,35,0,20191231]
[null,"1","T03823","TECNICO SUPERIOR","P",2,63,85,7,20190101,999999,0,0,745.58,35,35,0,20191231]
[null,"1","T03823","TECNICO SUPERIOR","P",2,74,85,7,20190101,999999,0,0,831.32,35,35,0,20191231]
[null,"1","T03823","TECNICO SUPERIOR","P",2,15,85,7,20190101,999999,0,0,216.11,35,35,0,20191231]
[null,"1","T03823","TECNICO SUPERIOR","P",2,13,85,7,20190101,999999,0,0,60,35,35,0,20191231]
[null,"1","T03823","TECNICO SUPERIOR","P",2,13,85,7,20190101,999999,0,0,80,35,35,0,20191231]
[null,"1","T03823","TECNICO SUPERIOR","P",2,30,85,7,20190101,999999,0,0,280.48,35,35,0,20191231]
[null,"1","T03823","TECNICO SUPERIOR","P",2,21,85,7,20190101,999999,0,0,800,35,35,0,20191231]
[null,"1","T03823","TECNICO SUPERIOR","P",2,100,85,7,20190101,999999,0,0,87.2,35,35,0,20191231]
[null,"1","T03823","TECNICO SUPERIOR","P",2,100,85,7,20190101,999999,0,0,149.6,35,35,0,20191231]
[null,"1","T03823","TECNICO SUPERIOR","P",2,100,85,7,20190101,999999,0,0,212,35,35,0,20191231]
[null,"1","T03823","TECNICO SUPERIOR","P",2,100,85,7,20190101,999999,0,0,274.39999999999998,35,35,0,20191231]
[null,"1","T03823","TECNICO SUPERIOR","P",2,100,85,7,20190101,999999,0,0,336.8,35,35,0,20191231]
[null,"1","T03823","TECNICO SUPERIOR","P",2,100,85,7,20190101,999999,0,0,374.2,35,35,0,20191231]
[null,"1","T03823","TECNICO SUPERIOR","P",2,100,85,7,20190101,999999,0,0,436.6,35,35,0,20191231]
[null,"1","T03823","TECNICO SUPERIOR","P",2,100,85,7,20190101,999999,0,0,499,35,35,0,20191231]
[null,"1","T03823","TECNICO SUPERIOR","P",2,100,85,7,20190101,999999,0,0,561.4,35,35,0,20191231]
[null,"1","T03823","TECNICO SUPERIOR","P",2,100,85,7,20190101,999999,0,0,623.79999999999995,35,35,0,20191231]
[null,"1","T03823","TECNICO SUPERIOR","P",2,100,85,7,20190101,999999,0,0,636.19000000000005,35,35,0,20191231]
[null,"1","T03823","TECNICO SUPERIOR","P",2,100,85,7,20190101,999999,0,0,698.59,35,35,0,20191231]
[null,"1","T03823","TECNICO SUPERIOR","P",2,100,85,7,20190101,999999,0,0,760.99,35,35,0,20191231]
[null,"1","T03823","TECNICO SUPERIOR","P",2,100,85,7,20190101,999999,0,0,823.39,35,35,0,20191231]
[null,"1","T03823","TECNICO SUPERIOR","P",2,100,85,7,20190101,999999,0,0,885.79,35,35,0,20191231]
[null,"1","T03823","TECNICO SUPERIOR","P",2,100,85,7,20190101,999999,0,0,923.19,35,35,0,20191231]
[null,"1","T03823","TECNICO SUPERIOR","P",2,100,85,7,20190101,999999,0,0,985.59,35,35,0,20191231]
[null,"1","T03823","TECNICO SUPERIOR","P",2,100,85,7,20190101,999999,0,0,1047.99,35,35,0,20191231]
[null,"1","T03823","TECNICO SUPERIOR","P",2,100,85,7,20190101,999999,0,0,1110.3900000000001,35,35,0,20191231]
[null,"1","T03823","TECNICO SUPERIOR","P",2,100,85,7,20190101,999999,0,0,1172.79,35,35,0,20191231]
[null,"1","T03823","TECNICO SUPERIOR","P",2,100,85,7,20190101,999999,0,0,1210.19,35,35,0,20191231]
[null,"1","T03823","TECNICO SUPERIOR","P",2,100,85,7,20190101,999999,0,0,1272.5899999999999,35,35,0,20191231]
[null,"1","T03823","TECNICO SUPERIOR","P",2,100,85,7,20190101,999999,0,0,1334.99,35,35,0,20191231]
[null,"1","T03823","TECNICO SUPERIOR","P",2,100,85,7,20190101,999999,0,0,1397.39,35,35,0,20191231]
[null,"1","T03823","TECNICO SUPERIOR","P",2,100,85,7,20190101,999999,0,0,1459.79,35,35,0,20191231]
[null,"1","T03823","TECNICO SUPERIOR","P",2,100,85,7,20190101,999999,0,0,1522.19,35,35,0,20191231]
[null,"1","T03823","TECNICO SUPERIOR","P",2,4,85,7,20190101,999999,0,0,200,35,35,0,20191231]
[null,"1","T03823","TECNICO SUPERIOR","P",2,4,85,7,20190101,999999,0,0,125,35,35,0,20191231]
[null,"1","T03823","TECNICO SUPERIOR","P",2,4,85,7,20190101,999999,0,0,175,35,35,0,20191231]
[null,"1","T03823","TECNICO SUPERIOR","P",2,4,85,7,20190101,999999,0,0,200,35,35,0,20191231]
[null,"1","T03823","TECNICO SUPERIOR","P",2,4,85,7,20190101,999999,0,0,225,35,35,0,20191231]
[null,"1","T03823","TECNICO SUPERIOR","P",2,20,85,7,20190101,999999,0,0,2000,35,35,0,20191231]
[null,"1","T03823","TECNICO SUPERIOR","P",2,20,85,7,20190101,999999,0,0,1200,35,35,0,20191231]
[null,"1","T03823","TECNICO SUPERIOR","P",2,11,85,7,20190101,999999,0,0,225,35,35,0,20191231]
[null,"1","T03823","TECNICO SUPERIOR","P",2,11,85,7,20190101,999999,0,0,565,35,35,0,20191231]
[null,"1","T03824","TECNICO SUPERIOR","P",2,6,85,7,20190101,999999,0,0,8644.4,35,35,0,20191231]
[null,"1","T03825","TECNICO SUPERIOR","P",2,206,85,7,20190101,999999,0,0,1838.8,35,35,0,20191231]
[null,"1","T03826","TECNICO SUPERIOR","P",2,5,85,7,20190101,999999,0,0,1944.99,35,35,0,20191231]
[null,"1","T03827","TECNICO SUPERIOR","P",2,7,85,7,20190101,999999,0,0,2161.1,35,35,0,20191231]
[null,"1","T03828","TECNICO SUPERIOR","P",2,31,85,7,20190101,999999,0,0,2593.3200000000002,35,35,0,20191231]
[null,"1","T03829","TECNICO SUPERIOR","P",2,46,85,7,20190101,999999,0,0,864.44,35,35,0,20191231]
[null,"1","T03830","TECNICO SUPERIOR","P",2,421,85,7,20190101,999999,0,0,1080.55,35,35,0,20191231]
[null,"1","CF14070","DELEGADO","P",5,1,97,"MB2",20190101,999999,0,14611.06,0,40,40,0,20191231]
[null,"1","CF14070","DELEGADO","P",5,8,97,"MB2",20190101,999999,0,51060.12,0,40,40,0,20191231]
[null,"1","CF14070","DELEGADO","P",5,9,97,"MB2",20190101,999999,0,77,0,40,40,0,20191231]
[null,"1","CF14070","DELEGADO","P",5,6,97,"MB2",20190101,999999,0,19481.41,0,40,40,0,20191231]
[null,"1","CF14070","DELEGADO","P",5,206,97,"MB2",20190101,999999,0,68080,0,40,40,0,20191231]
[null,"1","CF14070","DELEGADO","P",5,5,97,"MB2",20190101,999999,0,2435.1799999999998,0,40,40,0,20191231]
[null,"1","CF36014","COORDINADOR REGIONAL","P",5,1,95,"OA1",20190101,999999,5164.5,0,0,40,40,0,20191231]
[null,"1","CF36014","COORDINADOR REGIONAL","P",5,8,95,"OA1",20190101,999999,11881.74,0,0,40,40,0,20191231]
[null,"1","CF36014","COORDINADOR REGIONAL","P",5,9,95,"OA1",20190101,999999,77,0,0,40,40,0,20191231]
[null,"1","CF36014","COORDINADOR REGIONAL","P",5,6,95,"OA1",20190101,999999,6886,0,0,40,40,0,20191231]
[null,"1","CF36014","COORDINADOR REGIONAL","P",5,206,95,"OA1",20190101,999999,15842.32,0,0,40,40,0,20191231]
[null,"1","CF36014","COORDINADOR REGIONAL","P",5,5,95,"OA1",20190101,999999,860.75,0,0,40,40,0,20191231]
[null,"1","CF01059","JEFE DE DEPARTAMENTO","P",5,1,93,"OA1",20190101,999999,0,4685.7,0,40,40,0,20191231]
[null,"1","CF01059","JEFE DE DEPARTAMENTO","P",5,8,93,"OA1",20190101,999999,0,12360.54,0,40,40,0,20191231]
[null,"1","CF01059","JEFE DE DEPARTAMENTO","P",5,9,93,"OA1",20190101,999999,0,77,0,40,40,0,20191231]
[null,"1","CF01059","JEFE DE DEPARTAMENTO","P",5,4,93,"OA1",20190101,999999,0,200,0,40,40,0,20191231]
[null,"1","CF01059","JEFE DE DEPARTAMENTO","P",5,6,93,"OA1",20190101,999999,0,6247.6,0,40,40,0,20191231]
[null,"1","CF01059","JEFE DE DEPARTAMENTO","P",5,206,93,"OA1",20190101,999999,0,16480.72,0,40,40,0,20191231]
[null,"1","CF01059","JEFE DE DEPARTAMENTO","P",5,5,93,"OA1",20190101,999999,0,780.95,0,40,40,0,20191231]
[null,"1","CF36014","COORDINADOR DE ZONA","P",5,1,92,"OA1",20190101,999999,0,4328.8599999999997,0,40,40,0,20191231]
[null,"1","CF36014","COORDINADOR DE ZONA","P",5,8,92,"OA1",20190101,999999,0,12717.4,0,40,40,0,20191231]
[null,"1","CF36014","COORDINADOR DE ZONA","P",5,9,92,"OA1",20190101,999999,0,77,0,40,40,0,20191231]
[null,"1","CF36014","COORDINADOR DE ZONA","P",5,4,92,"OA1",20190101,999999,0,200,0,40,40,0,20191231]
[null,"1","CF36014","COORDINADOR DE ZONA","P",5,6,92,"OA1",20190101,999999,0,5771.81,0,40,40,0,20191231]
[null,"1","CF36014","COORDINADOR DE ZONA","P",5,206,92,"OA1",20190101,999999,0,16956.53,0,40,40,0,20191231]
[null,"1","CF36014","COORDINADOR DE ZONA","P",5,5,92,"OA1",20190101,999999,0,721.48,0,40,40,0,20191231]
[null,"1","CF36014","COORDINADOR DE ZONA","P",5,1,92,"OA1",20190101,999999,0,0,4649.3599999999997,40,40,0,20191231]
[null,"1","CF36014","COORDINADOR DE ZONA","P",5,8,92,"OA1",20190101,999999,0,0,12396.9,40,40,0,20191231]
[null,"1","CF36014","COORDINADOR DE ZONA","P",5,9,92,"OA1",20190101,999999,0,0,77,40,40,0,20191231]
[null,"1","CF36014","COORDINADOR DE ZONA","P",5,4,92,"OA1",20190101,999999,0,0,200,40,40,0,20191231]
[null,"1","CF36014","COORDINADOR DE ZONA","P",5,6,92,"OA1",20190101,999999,0,0,6199.15,40,40,0,20191231]
[null,"1","CF36014","COORDINADOR DE ZONA","P",5,206,92,"OA1",20190101,999999,0,0,16529.2,40,40,0,20191231]
[null,"1","CF36014","COORDINADOR DE ZONA","P",5,5,92,"OA1",20190101,999999,0,0,774.89,40,40,0,20191231]
[null,null,null,null,null,null,null,null,null,null,"Total Zona A:"]
[null,null,null,null,null,null,null,null,null,null,null,"Total Zona B:"]
[null,null,null,null,null,null,null,null,null,null,null,null,"Total Zona C:"]
[]
[null,"Fuente : Información proporcionada por las Entidades Federativas"]

{"sheet":"II D) 7 3","index":12,"n_rows":133,"n_cols":11,"rows_kept":133,"cut":false,"hidden":false,"merged":[[9,1,9,7],[8,9,8,10]]}
[]
[]
[]
[]
[]
[]
[]
[]
[null,"Formato: Catálogo de Percepciones y Deducciones",null,null,null,null,null,null,"Entidad Federativa:",{"$f":"IF('Caratula Resumen'!D21=\"Elige el Periodo…\",\"\",'Caratula Resumen'!D21)","v":" NAYARIT "}]
[null,{"$f":"IF('Caratula Resumen'!D22=\"Elige el Periodo…\",\"\",'Caratula Resumen'!D22)","v":"Fondo de Aportaciones para la Educación Tecnológica y de Adultos/Instituto Nacional para la Educación de los Adultos (FAETA/INEA)"},null,null,null,null,null,null,null,null,{"$f":"IF('Caratula Resumen'!D23=\"Elige el Periodo…\",\"\",'Caratula Resumen'!D23)","v":"1er. Trimestre"}]
[]
[]
[null,"Identificador origen presupuestal de la plaza","Tipo de concepto de pago ","Origen de financiamiento del concepto de percepciones.","Porcentaje de participación federal por fuente de recursos","Grupo al que pertenece concepto de pago (Percepción y/o Deducción)","Clave de concepto de pago","Descripción del concepto de pago ","Partida presupuestal","Fecha del","Fecha  al"]
[]
[null,"Identificador origen presupuestal de la plaza","Tipo de concepto de pago ","Origen de financiamiento del concepto de percepciones.","Porcentaje de participación federal por fuente de recursos","Grupo al que pertenece concepto de pago (Percepción y/o Deducción)","Clave de concepto de pago","Descripción del concepto de pago ","Partida presupuestal","Fecha del","Fecha  al"]
[null,1,"P","F",100,"P0",1,"SUELDOS",83101,20190101,99999999]
[null,1,"P","F",100,"P0",2,"DIFERENCIA DE SUELDO",83101,20190101,99999999]
[null,1,"P","F",100,"P1",3,"CANTIDAD ADICIONAL",83101,20190101,99999999]
[null,1,"P","F",100,"P2",4,"QUINQUENIOS",83101,20190101,99999999]
[null,1,"P","F",100,"P2",5,"PRIMA VACACIONAL",83101,20190101,99999999]
[null,1,"P","F",100,"P2",6,"AGUINALDO",83101,20190101,99999999]
[null,1,"P","F",100,"P2",7,"PERMISOS ECONOMICOS",83101,20190101,99999999]
[null,1,"P","F",100,"P1",8,"COMPENSACION GARANT.",83101,20190101,99999999]
[null,1,"P","F",100,"P2",9,"DESPENSA",83101,20190101,99999999]
[null,1,"P","F",100,"P2",10,"OTRAS PRESTACIONES",83101,20190101,99999999]
[null,1,"P","F",100,"P2",11,"PREVISION SOCIAL MULTIPLE",83101,20190101,99999999]
[null,1,"P","F",100,"P2",12,"AYUDA PARA SERVICIOS",83101,20190101,99999999]
[null,1,"P","F",100,"P2",13,"BECAS",83101,20190101,99999999]
[null,1,"P","F",100,"P2",14,"AYUDA PARA SERVICIOS",83101,20190101,99999999]
[null,1,"P","F",100,"P2",15,"DIAS DE PUNTUALIDAD",83101,20190101,99999999]
[null,1,"P","F",100,"P2",17,"RET PRIMA VAC",83101,20190101,99999999]
[null,1,"P","F",100,"P2",18,"DIAS ECONOMICOS",83101,20190101,99999999]
[null,1,"P","F",100,"P2",20,"CAPACITACION Y DESARROLLO",83101,20190101,99999999]
[null,1,"P","F",100,"P2",21,"AYUDA PARA ANTEOJOS",83101,20190101,99999999]
[null,1,"P","F",100,"P2",24,"HOMOLOGACION",83101,20190101,99999999]
[null,1,"P","F",100,"P2",25,"CANASTA MATERNAL",83101,20190101,99999999]
[null,1,"P","F",100,"P2",27,"ESTIMULO X PRODUCC Y CALI",83101,20190101,99999999]
[null,1,"P","F",100,"P2",28,"DEVOLUCION CUOTA SIND.",83101,20190101,99999999]
[null,1,"P","F",100,"P2",29,"AYUDA PARA ANTEOJOS",83101,20190101,99999999]
[null,1,"P","F",100,"P2",30,"GUARDERIA",83101,20190101,99999999]
[null,1,"P","F",100,"P2",31,"PUNTUALIDAD PERFECTA",83101,20190101,99999999]
[null,1,"P","F",100,"P2",32,"RETROACTIVO PRIMA VAC",83101,20190101,99999999]
[null,1,"P","F",100,"P2",35,"BONO A LA PROD. Y EFIC.",83101,20190101,99999999]
[null,1,"P","F",100,"P2",36,"REROACTIVO COMP.  GARANTI",83101,20190101,99999999]
[null,1,"P","F",100,"P2",37,"RETROAC. PREV. SOCIAL",83101,20190101,99999999]
[null,1,"P","F",100,"P2",40,"RETROACTIVO DESPENSA",83101,20190101,99999999]
[null,1,"P","F",100,"P2",41,"RETROACTIVO PUNTUALIDAD",83101,20190101,99999999]
[null,1,"P","F",100,"P2",42,"RETROACTIVO P/ ANTIGUEDAD",83101,20190101,99999999]
[null,1,"P","F",100,"P2",43,"RETROACTIVO AYUDA P/SERV.",83101,20190101,99999999]
[null,1,"P","F",100,"P2",45,"DEVOLUCION DE GUARDERIA",83101,20190101,99999999]
[null,1,"P","F",100,"P2",46,"RECALENDARIZACION",83101,20190101,99999999]
[null,1,"P","F",100,"P2",50,"PRIMA DE ANTIGUEDAD",83101,20190101,99999999]
[null,1,"P","F",100,"P2",51,"APARATOS ORTOPEDICOS",83101,20190101,99999999]
[null,1,"P","F",100,"P2",52,"AYUDA TITULACION",83101,20190101,99999999]
[null,1,"P","F",100,"P2",53,"RETRO AYUDA P/ANTEOJOS",83101,20190101,99999999]
[null,1,"P","F",100,"P2",54,"APARATOS ORTOPEDICOS",83101,20190101,99999999]
[null,1,"P","F",100,"P2",55,"CANASTILLA MATERNAL",83101,20190101,99999999]
[null,1,"P","F",100,"P2",56,"RETR TRANSPORTE",83101,20190101,99999999]
[null,1,"P","F",100,"P2",57,"RETR CAPAC. Y DESARROLLO",83101,20190101,99999999]
[null,1,"P","F",100,"P2",60,"GRATIFICACION POR RENUNCI",83101,20190101,99999999]
[null,1,"P","F",100,"P2",62,"10 , 15, 20 Y 25 AÑOS",83101,20190101,99999999]
[null,1,"P","F",100,"P2",63,"PROFESIONALIZACION B",83101,20190101,99999999]
[null,1,"P","F",100,"P2",64,"PAGO POR UNICA VEZ",83101,20190101,99999999]
[null,1,"P","F",100,"P2",65,"RETROACT PROFES",83101,20190101,99999999]
[null,1,"P","F",100,"P2",66,"RETROACTIVO GUARDERIA",83101,20190101,99999999]
[null,1,"P","F",100,"P2",67,"COMPENSACION",83101,20190101,99999999]
[null,1,"P","F",100,"P2",69,"DIF. PRIMA ANTIGUEDAD",83101,20190101,99999999]
[null,1,"P","F",100,"P2",73,"RETRO PROFESIONALIZ..2005",83101,20190101,99999999]
[null,1,"P","F",100,"P2",74,"PROFESIONALIZACION C",83101,20190101,99999999]
[null,1,"P","F",100,"P2",75,"RETROACTIVO DE BECAS",83101,20190101,99999999]
[null,1,"P","F",100,"P2",78,"DIA ADICIONAL PRIMA VACAC",83101,20190101,99999999]
[null,1,"P","F",100,"P2",79,"DIA DEL TRABAJADOR INEA",83101,20190101,99999999]
[null,1,"P","F",100,"P2",80,"RETRO PRIMA DE ANTIGUEDAD",83101,20190101,99999999]
[null,1,"P","F",100,"P2",101,"VALES DE DESPENSA",83101,20190101,99999999]
[null,1,"P","F",100,"P2",102,"PREMIO ADMON PUBLICA",83101,20190101,99999999]
[null,1,"P","F",100,"P2",104,"RETROACTIVO QUINQUENIO",83101,20190101,99999999]
[null,1,"P","F",100,"P2",105,"DIFERENCIA DE AGUINALDO",83101,20190101,99999999]
[null,1,"P","F",100,"P2",114,"AYUDA DE TRANSPORTE 2009",83101,20190101,99999999]
[null,1,"P","F",100,"P2",206,"AGUINALDO COMPENSACION",83101,20190101,99999999]
[null,1,"P","F",100,"P2",401,"RETROACTIVO SUELDO",83101,20190101,99999999]
[null,1,"P","F",100,"P2",402,"RETROACTIVO CANTIDAD ADIC",83101,20190101,99999999]
[null,1,"P","F",100,"P2",403,"DIF. CANTIDAD ADICIONAL",83101,20190101,99999999]
[null,1,"P","F",100,"P2",404,"RETROACTIVO COMPENSACION",83101,20190101,99999999]
[null,1,"P","F",100,"P2",405,"DIF. PRIMA VACACIONAL",83101,20190101,99999999]
[null,1,"P","F",100,"P2",406,"RETROAC. COMPENS. EXTRA",83101,20190101,99999999]
[null,1,"P","F",100,"P2",408,"DIF. COMP. GARANT.",83101,20190101,99999999]
[null,1,"P","F",100,"P2",415,"DIF. DIAS DE PUNTUALIDAD",83101,20190101,99999999]
[null,1,"P","F",100,"P2",418,"DIF. DIAS ECONOMICOS",83101,20190101,99999999]
[null,1,"P","F",100,"P2",420,"A TRANSPORTE",83101,20190101,99999999]
[null,1,"P","F",100,"P2",421,"ESTIMULO NOTAS BUENAS",83101,20190101,99999999]
[null,1,"D",null,100,"D2",500,"SUSPENSIONES",83101,20190101,99999999]
[null,1,"D",null,100,"D2",503,"DEVOLUCION AGUINALDO",83101,20190101,99999999]
[null,1,"D",null,100,"D2",525,"FONDO AHORRO RET. SNTEA",83101,20190101,99999999]
[null,1,"D",null,100,"D2",527,"APOYO  GASTOS FUNERAL",83101,20190101,99999999]
[null,1,"D",null,100,"D1",530,"ISR",83101,20190101,99999999]
[null,1,"D",null,100,"D1",533,"I.S.R. ESTIMULO 10-15 Y 2",83101,20190101,99999999]
[null,1,"D",null,100,"D2",534,"FALTAS",83101,20190101,99999999]
[null,1,"D",null,100,"D1",535,"IMPUESTO AGUINALDO",83101,20190101,99999999]
[null,1,"D",null,100,"D1",540,"FONDO/PENSION ISSSTE",83101,20190101,99999999]
[null,1,"D",null,100,"D1",541,"SERV.MED/MAT. ISSSTE",83101,20190101,99999999]
[null,1,"D",null,100,"D2",542,"PRESTAMO C.P. ISSSTE",83101,20190101,99999999]
[null,1,"D",null,100,"D2",543,"PRESTAMO M.P. ISSSTE",83101,20190101,99999999]
[null,1,"D",null,100,"D2",544,"PRES. HIP. FOVISSSTE",83101,20190101,99999999]
[null,1,"D",null,100,"D2",545,"PRESTAMO COMP. ISSSTE",83101,20190101,99999999]
[null,1,"D",null,100,"D2",549,"DESCUENTO DE COMPENSACION",83101,20190101,99999999]
[null,1,"D",null,100,"D2",550,"CUOTA SINDICAL",83101,20190101,99999999]
[null,1,"D",null,100,"D2",551,"PENSION ALIMENTICIA",83101,20190101,99999999]
[null,1,"D",null,100,"D2",552,"COMPLEMENTO PENSION A",83101,20190101,99999999]
[null,1,"D",null,100,"D2",553,"AJUSTE DE GUARDERIA",83101,20190101,99999999]
[null,1,"D",null,100,"D3",555,"CREDITO  INFONACOT",83101,20190101,99999999]
[null,1,"D",null,100,"D2",562,"SEG. VIDA IND AHISA",83101,20190101,99999999]
[null,1,"D",null,100,"D2",563,"SEGURO COL. DE RETIRO",83101,20190101,99999999]
[null,1,"D",null,100,"D2",564,"POT. SEGURO DE VIDA",83101,20190101,99999999]
[null,1,"D",null,100,"D2",567,"RETROACTIVO POTEN",83101,20190101,99999999]
[null,1,"D",null,100,"D2",568,"DEVOLUC. SEGURO RETIRO",83101,20190101,99999999]
[null,1,"D",null,100,"D2",569,"AJUSTE FONAC",83101,20190101,99999999]
[null,1,"D",null,100,"D2",570,"ANTICIPO DE SUELDO",83101,20190101,99999999]
[null,1,"D",null,100,"D2",571,"FONDO DE AHORRO CAP.",83101,20190101,99999999]
[null,1,"D",null,100,"D2",572,"SEGURO DE DAÑOS",83101,20190101,99999999]
[null,1,"D",null,100,"D1",573,"  I.S.R.  PROFES",83101,20190101,99999999]
[null,1,"D",null,100,"D3",574,"SERVICIOS FUNERARIOS",83101,20190101,99999999]
[null,1,"D",null,100,"D2",578,"SEGUROS FOVISSSTE",83101,20190101,99999999]
[null,1,"D",null,100,"D2",580,"RETROACTIVO FONAC",83101,20190101,99999999]
[null,1,"D",null,100,"D2",582,"ADEUDO PENSION ALIMENTIC.",83101,20190101,99999999]
[null,1,"D",null,100,"D1",583,"I.S.R. PREST. PERS. CONF.",83101,20190101,99999999]
[null,1,"D",null,100,"D2",584,"DEVOLUCION SEGURO POTEN",83101,20190101,99999999]
[null,1,"D",null,100,"D2",585,"OTRA DEDUCCION",83101,20190101,99999999]
[null,1,"D",null,100,"D3",586,"DEVOLUCION INFONACOT",83101,20190101,99999999]
[null,1,"D",null,100,"D1",587,"RETRO 6.125%",83101,20190101,99999999]
[null,1,"D",null,100,"D1",589,"AHORRO SOLIDARIO",83101,20190101,99999999]
[null,1,"D",null,100,"D1",590,"DEV AHORRO SOLIDARIO",83101,20190101,99999999]
[null,1,"D",null,100,"D1",591,"RECUP AHORRO SOL",83101,20190101,99999999]
[null,"Fuente : Información proporcionada por las Entidades Federativas"]

{"sheet":"E)","index":13,"n_rows":31,"n_cols":8,"rows_kept":31,"cut":false,"hidden":false,"merged":[[9,1,9,5],[12,1,14,1],[12,2,14,2],[13,7,14,7],[12,3,14,3],[12,4,14,4],[12,5,12,7],[13,5,14,5],[13,6,14,6]]}
[]
[]
[]
[]
[]
[]
[]
[]
[null,"Formato: Trabajadores que Cobran con RFC / CURP con Formato Incorrecto"]
[null,{"$f":"IF('Caratula Resumen'!D22=\"Elige el Periodo…\",\"\",'Caratula Resumen'!D22)","v":"Fondo de Aportaciones para la Educación Tecnológica y de Adultos/Instituto Nacional para la Educación de los Adultos (FAETA/INEA)"},null,null,null,null,null,{"$f":"IF('Caratula Resumen'!D23=\"Elige el Periodo…\",\"\",'Caratula Resumen'!D23)","v":"1er. Trimestre"}]
[]
[]
[null,"Entidad Federativa","RFC","CURP","NOMBRE TRABAJADOR","Motivo"]
[null,null,null,null,null,"Sin RFC o erroneo","RFC Sin Homoclave","Sin CURP o Erronea"]
[]
[]
[null,"Entidad Federativa","RFC","CURP","NOMBRE TRABAJADOR","Sin RFC o erroneo","RFC Sin Homoclave","Sin CURP o Erronea"]
[]
[]
[]
[]
[]
[]
[]
[null,"Total Personas : ",null,null,"Total Sin RFC o Erroneo:"]
[null,null,null,null,null,"Total RFC Sin Homoclave:"]
[null,null,null,null,null,null,"Total Sin CURP o Erroneo:"]
[null,"Fuente : Información proporcionada por las Entidades Federativas"]
[]
[]
[null,null,null," "]

{"sheet":"F) 1","index":14,"n_rows":28,"n_cols":19,"rows_kept":28,"cut":false,"hidden":false,"merged":[[9,1,9,6],[12,15,13,15],[12,16,13,16],[12,17,12,18],[12,1,13,1],[12,2,13,2],[12,3,13,3],[12,4,13,4],[12,5,13,5],[12,6,13,6],[12,7,13,7],[12,8,12,14]]}
[]
[]
[]
[]
[]
[]
[]
[]
[null,"Formato: Trabajadores con Doble Asignación Salarial en Municipios no Colindantes Geográficamente"]
[null,{"$f":"IF('Caratula Resumen'!D22=\"Elige el Periodo…\",\"\",'Caratula Resumen'!D22)","v":"Fondo de Aportaciones para la Educación Tecnológica y de Adultos/Instituto Nacional para la Educación de los Adultos (FAETA/INEA)"},null,null,null,null,null,null,null,null,null,null,null,null,null,null,null,null,{"$f":"IF('Caratula Resumen'!D23=\"Elige el Periodo…\",\"\",'Caratula Resumen'!D23)","v":"1er. Trimestre"}]
[]
[]
[null,"Entidad Federativa","Municipio","Localidad","RFC","CURP","Nombre del Trabajador","Clave integrada","Clave Presupuestal",null,null,null,null,null,null,"Clave CT","Nombre CT","Periodo en el CT"]
[null,null,null,null,null,null,null,null,"Partida Presupuestal","Código de Pago","Clave de Unidad","Clave de Sub Unidad","Clave de Categoría","Horas Semana Mes ","Número de Plaza",null,null,"Desde","Hasta"]
[]
[null,"Entidad Federativa","Municipio","Localidad","RFC","CURP","Nombre del Trabajador","Clave integrada","Partida Presupuestal","Código de Pago","Clave de Unidad","Clave de Sub Unidad","Clave de Categoría","Horas semana mes","Número de Plaza","Clave CT","Nombre CT","Periodo en el CT\nDesde","Periodo en el CTH\nasta"]
[]
[]
[]
[]
[]
[]
[]
[null,null,"Total Personas : ",null,null,null,null,null,null,null,null,null,"Total Plazas : "]
[]
[]
[null,"Fuente : Información proporcionada por las Entidades Federativas"]
[null,"Importante: Listar Sólo los Municipios no Colindantes"]

{"sheet":"F) 2","index":15,"n_rows":28,"n_cols":20,"rows_kept":28,"cut":false,"hidden":false,"merged":[[13,3,14,3],[13,4,14,4],[13,5,14,5],[10,1,10,9],[13,19,14,19],[13,18,14,18],[13,6,13,12],[13,13,14,13],[13,14,14,14],[13,15,14,15],[13,16,13,17],[13,1,14,1],[13,2,14,2]]}
[]
[]
[]
[]
[]
[]
[]
[]
[]
[null,"Formato: Trabajadores Ocupando Plazas que Superan el Número de Horas de Compatibilidad Autorizadas"]
[null,{"$f":"IF('Caratula Resumen'!D22=\"Elige el Periodo…\",\"\",'Caratula Resumen'!D22)","v":"Fondo de Aportaciones para la Educación Tecnológica y de Adultos/Instituto Nacional para la Educación de los Adultos (FAETA/INEA)"},null,null,null,null,null,null,null,null,null,null,null,null,null,null,null,null,{"$f":"IF('Caratula Resumen'!D23=\"Elige el Periodo…\",\"\",'Caratula Resumen'!D23)","v":"1er. Trimestre"}]
[]
[]
[null,"Entidad Federativa","RFC","CURP","Nombre","Clave integrada","Clave Presupuestal",null,null,null,null,null,null,"CT","Nombre CT","Turno CT","Periodo",null,"Total de Horas en el CT","Horas de compatibilidad de la categoría"]
[null,null,null,null,null,null,"Partida Presupuestal","Código de Pago","Clave de Unidad","Clave de Sub Unidad","Clave de Categoría","Horas Semana Mes ","Número de Plaza",null,null,null,"Desde","Hasta"]
[]
[null,"Entidad Federativa","RFC","CURP","Nombre","Clave integrada","Partida Presupuestal","Código de Pago","Clave de Unidad","Clave de Sub Unidad","Clave de Categoría","Horas semana mes","Número de plaza","CT","Nombre CT","Turno CT","Periodo\nDesde","Periodo\nHasta","Total de Horas en el CT","Horas de compatibilidad de la categoría"]
[]
[]
[]
[]
[]
[]
[]
[null,"Total Personas : ",null,null,null,null,null,null,null,null,"Total Plazas : "]
[]
[]
[null,"Fuente : Información proporcionada por las Entidades Federativas"]

{"sheet":"G)","index":16,"n_rows":29,"n_cols":20,"rows_kept":29,"cut":false,"hidden":false,"merged":[[13,19,14,19],[13,13,14,13],[13,14,14,14],[13,15,13,16],[13,17,14,17],[13,18,14,18],[10,1,10,8],[12,5,12,11],[13,1,14,1],[13,2,14,2],[13,3,14,3],[13,4,14,4],[13,5,14,5],[13,6,13,12]]}
[]
[]
[]
[]
[]
[]
[]
[]
[]
[null,"Formato: Trabajadores Cuyo Salario Básico Supere los Ingresos Promedio de un Docente en la Categoría más Alta del Tabulador Salarial Correspondiente a Cada Entidad"]
[null,{"$f":"IF('Caratula Resumen'!D22=\"Elige el Periodo…\",\"\",'Caratula Resumen'!D22)","v":"Fondo de Aportaciones para la Educación Tecnológica y de Adultos/Instituto Nacional para la Educación de los Adultos (FAETA/INEA)"},null,null,null,null,null,null,null,null,null,null,null,null,null,null,null,null,null,{"$f":"IF('Caratula Resumen'!D23=\"Elige el Periodo…\",\"\",'Caratula Resumen'!D23)","v":"1er. Trimestre"}]
[]
[]
[null,"Entidad Federativa","R.F.C.","CURP","Nombre","Clave integrada","Clave Presupuestal Integrada y Categoria aparte",null,null,null,null,null,null,"Clave CT Origen","Nombre CT","Periodo",null,"Monto de Remuneraciones Mensuales ","Monto de referencia","Diferencia\n(R-S)"]
[null,null,null,null,null,null,"Partida Presupuestal","Código de Pago","Clave de Unidad","Clave de Sub Unidad","Clave de Categoría","Horas Semana Mes ","Número de Plaza",null,null,"Desde","Hasta"]
[]
[null,"Entidad Federativa","R.F.C.","CURP","Nombre","Clave integrada","Partida Presupuestal","Código de Pago","Clave de Unidad","Clave de Sub Unidad","Clave de Categoría","Horas Semana Mes ","No. de plaza","CT","Nombre CT","Periodo\nDesde","Periodo\nHasta","Monto de Remuneraciones Mensuales ","Monto de referencia","Diferencia\n(R-S)"]
[]
[]
[]
[]
[]
[]
[]
[null,"Total Personas : ",null,null,null,null,null,null,null,null,null,null,null,null,"Total Remuneraciones Mensuales:"]
[]
[null,null,null,null,null,null,null,null,null,null,null,null,null,null,null,null,null,"Total Diferencia:"]
[]
[null,"Fuente : Información proporcionada por las Entidades Federativas"]

{"sheet":"Listas","index":17,"n_rows":42,"n_cols":8,"rows_kept":42,"cut":false,"hidden":true,"merged":[]}
[]
[]
[]
[null,"Elige un Fondo…"]
[null,"Fondo de Aportaciones para la Educación Básica y Normal (FAEB)"]
[null,"Fondo de Aportaciones para la Educación Tecnológica y de Adultos/Colegio Nacional de Educación Profesional Técnica (FAETA/CONALEP)"]
[null,"Fondo de Aportaciones para la Educación Tecnológica y de Adultos/Instituto Nacional para la Educación de los Adultos (FAETA/INEA)"]
[]
[]
[null,null,null,null,null,null,null,"Elige la Entidad Federativa…"]
[null,"Elige el Periodo…",null,null,null,null,null,"AGUASCALIENTES"]
[null,"1er. Trimestre",null,null,null,null,null,"BAJA CALIFORNIA"]
[null,"2do. Trimestre",null,null,null,null,null,"BAJA CALIFORNIA SUR"]
[null,"3er. Trimestre",null,null,null,null,null,"CAMPECHE"]
[null,"4to. Trimestre",null,null,null,null,null,"COAHUILA "]
[null,null,null,"Elige el Año…",null,null,null,"COLIMA "]
[null,null,null,2013,null,null,null,"CHIAPAS "]
[null,null,null,2014,null,null,null,"CHIHUAHUA "]
[null,null,null,2015,null,null,null,"DISTRITO FEDERAL"]
[null,null,null,2016,null,null,null," DURANGO "]
[null,null,null,2017,null,null,null," GUANAJUATO "]
[null,null,null,2018,null,null,null," GUERRERO "]
[null,null,null,null,null,null,null," HIDALGO"]
[null,null,null,null,null,null,null," JALISCO "]
[null,null,null,null,null,null,null," MEXICO "]
[null,null,null,null,null,null,null," MICHOACAN "]
[null,null,null,null,null,null,null," MORELOS "]
[null,null,null,null,null,null,null," NAYARIT "]
[null,null,null,null,null,null,null," NUEVO LEON"]
[null,null,null,null,null,null,null," OAXACA "]
[null,null,null,null,null,null,null," PUEBLA "]
[null,null,null,null,null,null,null," QUERETARO "]
[null,null,null,null,null,null,null," QUINTANA ROO"]
[null,null,null,null,null,null,null," SAN LUIS"]
[null,null,null,null,null,null,null," SINALOA "]
[null,null,null,null,null,null,null," SONORA "]
[null,null,null,null,null,null,null," TABASCO "]
[null,null,null,null,null,null,null," TAMAULIPAS "]
[null,null,null,null,null,null,null," TLAXCALA "]
[null,null,null,null,null,null,null," VERACRUZ"]
[null,null,null,null,null,null,null," YUCATÁN "]
[null,null,null,null,null,null,null," ZACATECAS "]